«

»

Dec 11 2015

JD Edwards 9.2 Standalone (DEMO) Installation Tutorial

VN:F [1.9.22_1171]
Rating: 4.0/5 (24 votes cast)

Standalone 9.2 Install JD Edwards Enterprise One 9.2 Standalone Demo (Oracle version) on your PC or server with this step by step guide.Standalone

Very Important:

a. This version (according to the Oracle Docs) is designed to run on Windows 7 x64, Windows 2012 R2, Windows 8.1 Even you install successfully in another version of Windows 64, some business functions don’t work as expected, so, stay with Windows 7 or 2012 R2 or 8.1 x64 and everything should work as expected.

b. Before you start with anything, turn OFF your Anti-virus, Firewall and Disable UAC (User Access Control). For security purposes you could enable again the Firewall and Anti-virus AFTER the installation was completed.

c. From Release E920 OC4J is removed. So first we have to install Oracle Weblogic Server using 32 bit JDK

This procedure was a result from information that I gathered from tips from another users and “trial and error” tests. Suggestions and comments are always welcome.

Before we get started, if you find any issue, do read through the comments or visit the troubleshooting guide for 9.2 installation

Let’s start!

  1. Certification or MTR for JD Edwards Standalone can be verified from certification tab of support portal.

           Tips: JD Edwards Standalone Certification can be verified under product “JD Edwards Development client”

  1. We verified the certifications, now we need to install the below components for complete the installation of JD Edwards 9.2 Standalone Successfully.
  2. Software Download
  3. Prerequisites
  4. Installation of Oracle Web logic Server
  5. Installation of Oracle 12c Client
  6. Installation of Oracle E1local 12c DB
  7. Installation of Standalone Development client

Standalone 9.2, Oracle Welogic Server , Oracle 12c Client Setup files can be download from Oracle Software Delivery Cloud

  1. Software Download

In the Oracle Software Delivery Cloud home page, login using your credentials. Accept the “Export Restrictions” and this will lead to the Product Selection screen. For Product select “JD Edwards EnterpriseOne System Foundation” and Platform as “Microsoft Windows x64 (64-bit)

1

JD Edwards 9.2 Standalone Setup files comes in 4 zip files .This setup files are divided in two parts JD Edwards Standalone components and Oracle Database 12c components.

E9201png

As JD Edwards is 32 bit software, we need to install Oracle 12C 32 bit clientfor DB connection. For Product select “Oracle Database Enterprise Edition” and Platform as “Microsoft Windows x64 (64-bit)

3

Download the Oracle 12C 32 bit software (V47124-01.zip) setup file.

4

Download the below Oracle Weblogic Sever (V44413-01.zip) Setup files from Edelivery.

For Product select “Oracle Weblogic Server Enterprise Edition” and Platform as “Microsoft Windows x86 (32-bit)

5

Download the Oracle Web logic Server (V44413-01.zip) Setup file.

6

  1. Prerequisites

JD Edwards E920 Standalone client requires some of the prerequisites software to works perfectly

  1. Installation of Oracle Weblogic Server

From Release 9.2, OC4J has been removed so we need to install Oracle Weblogic Server for installing Local Web client

The Standalone Web Client can be only Installed on Oracle WebLogic Server application server.

Extract the download weblogic setup (V44413-01 zip)file in desktop or any folder, we will get the jar file fmw_12.1.3.0.0_wls.jar.

Now Open the Command Prompt as Run administrator and use cd command to navigate to 32 bit Java Installed location( cd C:\Program Files (x86)\java\jdk1.7.0_91\bin) and run the weblogic Server Installer using the below command (Java -jar c:\users\JDE\Desktop\fmw_12.1.3.0.0_wls.jar)

Enter the Oracle_Home as per your requirement and once installation completed uncheck the automatically launch the configuration wizard as shown in the below screen shot and click on finish.

7

Note: No need to create a domain for web logic server

  1. Install Oracle 12C 32 bit Client

From Release E920 with Oracle 12C 32 bit Client required non-administrator user for the Installation.

Unzip V47124-01.zip the file and run the Oracle Client Setup (“Setup.exe”) program.

Very important: Select Option 2 Administrator Option while installing Oracle DB 12c Client. Oracle Documentation state that “Runtime” also will work. So you may use them if running low on space.

Note: Oracle 12c 32 bit Client required non-administrator user for Installation, during the installation Enter the non-administrator user for installing Oracle 12c Client. If you already created non admin user use option 1 or use option 2 allow OUI to create non admin user ID.

8

Now, it’s time to install Oracle E1local DB 12c and JDE standalone Client itself. The install process is divided in two parts: the first install the Oracle Database and the second the JDE Client. The four files that we downloaded earlier must be combined to make a working setup installation extract the four files and you will have a folder structure like this

V100564-01-zip, V97804-01-zip, V97805-01-zip, V97806-01-zip

  1. Move the contents from folder V97805-01-01 to folder V97806-01
  2. Move the contents from folder V97804-01-01 to folder V100564-01
  3. Now Move the contents from folder V97806-01-01 to folder V100564-01\ThirdParty\ORACLE

Note : Now rename the Folder V100564-01 as standalone. It has the correct structured installation setup files.

Follow the below screenshots

Extract all 4 Setup files

E9202

  1. Move the contents from folder V97805-01-01 to folder V97806-01

E9203

        2. Move the contents from folder V97804-01-01 to folder V100564-01

        3. Now Move the contents from folder V97806-01-01 to folder V100564-01\ThirdParty\ORACLE

Note : Now rename the Folder V100564-01 as standalone. It has the correct structured installation setup files.

 5. Install E1Local 12c DB

From Release E920, Oracle E1local DB 12C required non-administrator user for Installation. Run the “InstallManager.exe”.Click Enterpriseone Oracle 12c Database Engine on JD Edwards Install Manager

12

In the next screen as we already created Non admin user while installing Oracle 12c 32 bit client, Use the Option 1 and provide the non-administrator credentials and click on Next. Once E1local 12C Successfully Installed, we will receive a saying that message “E1local successfully installed”. Now click yes to reboot the machine.

13

Once this is completed, check the following

Oracle has noted that there is a problem with IMPDP.exe and EXPDP.exe in their 12c database client software.
The solution: Ensure that both the 32-bit client and the 64-bit client are both in your PATH. (ie: c:\app\oracle\product\12.1.0\client_1\bin;C:\Oracle\E1Local\bin). Rename the impdp.exe and expdp.exe in the c:\app\oracle\product\12.1.0\client_1\bin folder to impdp.exe.bak and expdp.exe.bak. The install will then use the impdp.exe from the database install and everything will work.  You can find the Path Envt variables in the System Settings (from control panel) – Advanced Tab – Environment Variables – System Variables

 

  1. Install JD Edwards E920 Standalone Client

Once Machine rebooted we are ready to Install JD Edwards E920 Standalone client. Open InstallManager.exe as run as administrator. Click EnterpriseOne Standalone client on JD Edwards Install Manager. Enter the Installation path as per your requirement (i.e C:\JDEdwards\E920_1).

14

In the Next screen the select the package and click on next

15

Tips: If you face error message “Unable to connect to Database” in this step.

Could be the configuration issue with listener.ora & tnsnames.ora. Best Practice Provide the Hostname(Instead of IP or Localhost) as machine name in both the files.

JDK will not be shipped with E920 Installer. Install JDK and provide the path of the JDK as below and click on Next

Summary: This screen will shows the information which we provided in the above Steps. Verify it once more before we click on Install button.

16

JD Edwards Standalone E920 Installation will goes for minimum 2 hours and more ( Note : Time to complete the installation depends on Ram of your machine)

After the Installation of JD Edwards Standalone client completed, Installer automatically start to configure the Local web. During the local web configuration. We need to provide the web logic password(welcome1) for creating the domain and managed server for local web client as shown below

19

Installation of Local Web client will takes sometimes to configure the Local Web client on Oracle Weblogic Server 12C. Click on Exit Once you received below message.

17

Post Installation Task

Copy the file tnsnames.ora from the location C:\Oracle\E1local\Network\ADMIN to the location C:\app\Oracle\product\12.1.0\network\admin

Tips : Oracle 12c 32 client required for JD Edwards to connect to E1loccal (64 bit) DB & Main DB ( 64 bit)

Click on JD Edwards Icon on the Desktop and Enter username: DEMO, Password :DEMO.

login

fAT

Now You will be successfully Logged into DEMO920 Environment

Verify the Login and Local web client

Open the JD Edwards icon on the desktop and Enter the username as DEMO and Password as DEMO. Now you will be able to login into JDE Fat client.

Go to Tools  EnterpriseOne Menu to start the local web client. It will start the web logic server , now Internet explorer will open the web client as shown belowStandaloneWe have installed JD Edwards 9.2 Demo Successfully. Cheers!!!

For those who have issues with the Demo installation – Attached are the ini files from Jerome (jde.ini, jdbj.ini, jdeinterop.ini)

Please register to download the attachments in JD Edwards 9.2 Standalone (DEMO) Installation Tutorial

Best Regards
JDEClouds
JDEE1Tips Training is Our Passion

Published under the license.

VN:F [1.9.22_1171]
Rating: 4.0/5 (24 votes cast)
JD Edwards 9.2 Standalone (DEMO) Installation Tutorial, 4.0 out of 5 based on 24 ratings
(Visited 25,961 times, 1 visits today)

About the author

JDEClouds

We always like to share our Knowledge to everyone. We are here for sharing and helping you all.

119 comments

2 pings

Skip to comment form

  1. cgalvao

    Hi, good tutorial.

    I am getting “unable to send message to security server”… I have been trying everything … but not lucky. any thoughts ?

    808/3256 MAIN_THREAD Sun Dec 13 15:35:25.568004 jdecsec.c2170
    JDENET Error = eConnectionFailed

    808/3256 MAIN_THREAD Sun Dec 13 15:36:42.814001 jdecsec.c2706
    Failed to communicate with security server: Unable to send message to Security Server

    VN:F [1.9.22_1171]
    Rating: 0 (from 0 votes)
  2. cgalvao

    here is more thoughts ….

    I checked the port number from the section JDENET of jde.ini file:
    [JDENET]
    serviceNameListen=6012
    serviceNameConnect=6012

    But when I run netstat -ab and check which port is jdenet_n.exe running, I got this:
    [svchost.exe]
    UDP 0.0.0.0:6012 *:*
    [jdenet_n.exe]
    UDP 0.0.0.0:6013 *:*

    I modified the values for serviceNameListen and serviceNameConnect by 6013. I restarted EnterpriseOne Solution Explorer, still got the same message, but when I run again a netstat -ab, this time jdenet_n.exe got UDP 0.0.0.0:6014 *:*. And If I modify the value by 6014, at the next launch, jdenet_n.exe will run on port 6015, etc.

    VN:F [1.9.22_1171]
    Rating: 0 (from 0 votes)
    1. JDEClouds

      Strange Issue!!!

      Not required to change the default value for JDE.ini
      [JDENET]
      serviceNameListen=6012
      serviceNameConnect=6012

      Try to troubleshoot why default JDE Port 6012 is assigned to svchost.exe.

      And also check the antivirus & Firewall

      VN:F [1.9.22_1171]
      Rating: +1 (from 1 vote)
  3. jerome

    Hi all,

    Installation done, webclient fully functional.
    But in fat client, I’ve lot of error like:

    Business function Library load failed – D:\JDEdwards\E920_1\DEMO\bin32\CALLBSFN.dll
    Business function Library load failed – D:\JDEdwards\E920_1\DEMO\bin32\CALLBSFN.dll – [email protected]
    Business function Library load failed – D:\JDEdwards\E920_1\DEMO\bin32\CCORE.dll
    Business function Library load failed – D:\JDEdwards\E920_1\DEMO\bin32\CCORE.dll – [email protected]
    Business function Library load failed – D:\JDEdwards\E920_1\DEMO\bin32\COBLIB.dll
    Business function Library load failed – D:\JDEdwards\E920_1\DEMO\bin32\COBLIB.dll – [email protected]
    etc…
    Can someone help me ?
    thanks a lot

    VN:F [1.9.22_1171]
    Rating: 0 (from 0 votes)
    1. JDEClouds

      Dear Jerome,

      I hope you missed to install the required RTL.

      Install Microsoft Visual C++ RTL 2013 (x86 & x64) from the below website.

      https://www.microsoft.com/en-in/download/details.aspx?id=40784

      VN:F [1.9.22_1171]
      Rating: +3 (from 5 votes)
  4. cgalvao

    Hi jerome, JDECNC,Would you mind send me your config. files, so I can cross-check and review it ?

    from C:\E920_2\DEMO\ini\sbf folder ..

    1.jdbj
    2.jdeinterop

    from Win folder

    3.jde

    Ps. i have changed back my setting to 6012 in jde.ini , I see that jde_net listend on port 6013 but still now working…. I got a time out …

    348/208 MAIN_THREAD Mon Dec 14 22:32:54.679001 jdecsec.c2219
    JDENET Error = eTimeOut

    348/208 MAIN_THREAD Mon Dec 14 22:32:58.198001 jdecsec.c2706
    Failed to communicate with security server: Unable to locate Security Server

    thanks a lot for your help !!!

    VN:F [1.9.22_1171]
    Rating: 0 (from 0 votes)
  5. jerome

    hi JDECNC,

    Great !!! I’ve forgotten to install Microsoft Visual C++ RTL 2013.
    Now it’s OK !
    Thanks a lot.

    Jerome

    VN:F [1.9.22_1171]
    Rating: 0 (from 0 votes)
  6. Deepesh M Divakaran

    Attached the ini files from Jerome Linard

    VN:F [1.9.22_1171]
    Rating: -1 (from 1 vote)
  7. jerome

    Hi Deepesh,
    How Can attach the files

    VN:F [1.9.22_1171]
    Rating: 0 (from 0 votes)
    1. Deepesh M Divakaran

      Hi Jerome,
      You will have to upload to some file sharing sites and then post the link here.

      VN:F [1.9.22_1171]
      Rating: 0 (from 0 votes)
  8. Naidu

    Hi,

    I am trying to open to RDA (Report Design Aid). everything i am able to do, But, in report design air i am not seeing the RDA. I placed the group section, no section is visible. this is done in 9.2 demo version.

    could you please help me out in this?

    Naidu
    Jr. Technical consultant
    PCB Apps India Pvt. Ltd.

    VA:F [1.9.22_1171]
    Rating: 0 (from 0 votes)
    1. Deepesh M Divakaran

      Try adding this edit in JDE.ini
      [DEBUG]
      RegisterRDAReportView=1

      VN:F [1.9.22_1171]
      Rating: +1 (from 1 vote)
  9. chandra s reddy chaganti

    Hi…

    I installed 9.2 in windows 10 …everything is working fine….visual studio 2013 also working fine…

    but i have one question “how to configure bssv in jde 9.2 please provide …

    VN:F [1.9.22_1171]
    Rating: 0 (from 0 votes)
    1. Deepesh M Divakaran

      Hi Chandra,
      Try this out. Do let us know the results.
      http://www.jdesource.com/enterpriseone/enable-business-services-jd-edwards-demo-standalone/

      VN:F [1.9.22_1171]
      Rating: -1 (from 1 vote)
  10. chandra s reddy chaganti

    Hi Deepesh,

    I tryed above procedure…its showing enterprise class in jdevelopwr but while adding tables to the database value objectil its throwing database connection error…I think this error due to jde user creation..

    I created jde user two ways
    1) in E920/system/bin32
    ReconfigureDB.exe
    By using above application I decrypted sys/system password.then I created jde usere with sysadmin role and all prevailing..after that I encrypted sys user.

    By using above procedure also I am getting database error

    2)
    Send method is there in u r link..

    By using send method also I am getting database error..

    Datadabse error : Invalid user/password. [DATABASE_CONNECT_FAILED] Database Connection failed for DataSource System Local.

    VN:F [1.9.22_1171]
    Rating: 0 (from 0 votes)
  11. chandra s reddy chaganti

    Hi Deepesh,

    The below path is not there in E920 so please check…
    Copy JDBJ.ini from “C:\E900\system\OC4J\j2ee\home\applications\webclient.ear\webclient\WEB-INF\classes” to “C:\E900\DEMO\ini\sbf” and also to “C:\Windows” folders

    VN:F [1.9.22_1171]
    Rating: 0 (from 0 votes)
  12. bruegge

    Hi Deepesh,

    try to install on WinServer2012 the second time. When all routines are done and I click on the JDE icon I get a error message: “the program can’t start because mfc100u.dll is missing from your computer. Try reinstalling the program to fix the problem.”
    I think it has to do with C++; I have V Studio 2013 installed.

    Any help appreciated!

    VN:F [1.9.22_1171]
    Rating: 0 (from 0 votes)
    1. grand_national

      To overcome the mfc100u.dll error, I needed to install Visual C++ 2010 x86 The 2013 and 2012 versions did not correct the error.

      VN:F [1.9.22_1171]
      Rating: 0 (from 0 votes)
      1. JDEClouds

        You are receiving this error because required rtl is missing or you may have wrong version !

        1. In which OS you are installing JD Edwards Standalone 920?

        2. Check whether you have installed the below rtl version or not?

        Microsoft Visual Studio 2013 Redistributable (x86) is required for E920 Standalone. Please download and install “vcredist_x86.exe”
        http://www.microsoft.com/en-us/download/details.aspx?id=40784

        Best Regards
        JDEE1Tips
        http://www.JDEE1Tips.com

        VN:F [1.9.22_1171]
        Rating: +1 (from 1 vote)
  13. chandra s reddy chaganti

    Hi Bruegge,

    In below contains all runtimes(aio210 application) it will resolve such type errors.

    http://www.mediafire.com/?97erhoox4d3zabq

    VN:F [1.9.22_1171]
    Rating: 0 (from 0 votes)
  14. bruegge

    WORKS!!

    Thanks a lot for the quick help!

    VN:F [1.9.22_1171]
    Rating: 0 (from 0 votes)
  15. bruegge

    Hi,
    running an Inventory Transfer JDE came back with several errors; one is that the Next Number (NN) is not available. I checked the F0022 with UTB and it’s empty.
    How do I get access to the database itself using SQL Developer or Toad?
    Thx in advance!

    VN:F [1.9.22_1171]
    Rating: 0 (from 0 votes)
    1. Deepesh M Divakaran

      Oracle informs that the Standalone installation media has been pulled from the download sites in order to be re-mastered so it contains the missing data.
      Some tables such as F0022 are missing that is affecting the Standalone 9.2 functionality in wide range. Bug reference: 22389941

      VN:F [1.9.22_1171]
      Rating: 0 (from 0 votes)
  16. chandra s reddy chaganti

    Hi bruegge,

    Follow the below link

    http://www.jdesource.com/enterpriseone/jd-edwards-enterpriseone-9-1-demo-local-oracle-database-access/

    VN:F [1.9.22_1171]
    Rating: 0 (from 0 votes)
  17. chandra s reddy chaganti

    Hi Bruegge,

    Other wise follow below steps..

    i.Replace the first line in sqlnet.ora (C:\Oracle\E1Local\NETWORK\ADMIN):
    SQLNET.AUTHENTICATION_SERVICES=(NTS)

    ii.Restart windows meachine.

    iii.go to Start – Run – CMD and type in
    SQLPLUS /NoLog
    iv.In there, type
    CONNECT / AS SYSDBA
    This will get connected with DBA privileges
    v.Now, you can change the password of SYS to set a password with the following SQL
    ALTER USER sys IDENTIFIED BY oracle;
    Here “oracle” is the password for the user SYS.

    vi.Open SQLDeveloper, and input the user/pwd = sys/oracle, and role as SYSDBA,connection type=TNS,

    vii.Once done, execute the following SQL to create user

    VN:F [1.9.22_1171]
    Rating: 0 (from 0 votes)
  18. djmouse

    Hi the instructiuons say
    JD Edwards E920 Standalone client requires some of the prerequisites software to works perfectly

    Install 32 bit JDK – Oracle JDK 1.7.0_91

    I caanot find this version of the JDK to download on the Oracle site. Can I use a later version or must I use JDK 1.7.0_91

    VN:F [1.9.22_1171]
    Rating: -1 (from 1 vote)
    1. JDEClouds

      Wish you very happy New Year!!!

      Please find the below supported Oracle JDK version. You can install any one of the below. It works fine.

      Oracle JDK 1.7.0_55
      Oracle JDK 1.7.0_60
      Oracle JDK 1.7.0_65
      Oracle JDK 1.7.0_67
      Oracle JDK 1.7.0_71
      Oracle JDK 1.7.0_72
      Oracle JDK 1.7.0_75
      Oracle JDK 1.7.0_76
      Oracle JDK 1.7.0_79
      Oracle JDK 1.7.0_80
      Oracle JDK 1.7.0_85
      Oracle JDK 1.7.0_91

      VN:F [1.9.22_1171]
      Rating: +1 (from 1 vote)
  19. djmouse

    Thanks for your reply, however I don’t seem to be able to find these reoleases on the Oracle website only the newer releases such as Java SE Development Kit 8u66. Can you point me in the right direction of these releases ?

    VN:F [1.9.22_1171]
    Rating: 0 (from 0 votes)
    1. JDEClouds

      Thanks Bruegge for pointing out to the correct place to download 32 bit JDK.

      Djmouse: You can download the archived Java version from the below link

      http://www.oracle.com/technetwork/java/javase/downloads/java-archive-downloads-javase7-521261.html

      Oracle JDK 1.7.0_91 is not listed here. However you can download and install Java SE Development Kit 7u80 (Oracle JDK 1.7.0_80).

      VN:F [1.9.22_1171]
      Rating: 0 (from 0 votes)
  20. bruegge

    djmouse,
    it took me forever to find it, but finally, after searching with the right phrase JDK 7u91, I found it somewhere in Oracles archives.

    VN:F [1.9.22_1171]
    Rating: 0 (from 0 votes)
  21. Igor

    There is no JDE Standalone on edelivery.oracle.com

    The list show up this way for me:
    http://imgur.com/ix24n1E

    someone can help me?

    VA:F [1.9.22_1171]
    Rating: 0 (from 0 votes)
    1. JDEClouds

      Oracle informs that the Standalone installation media has been pulled from the download sites in order to be re-mastered so it contains the missing data.
      Some tables such as F0022 are missing that is affecting the Standalone 9.2 functionality in wide range. Bug reference: 22389941.
      I hope It will be available soon!!!

      VN:F [1.9.22_1171]
      Rating: 0 (from 0 votes)
  22. Shrikanth Hegde

    I think now oracle resolved the next number issue:

    DESCRIPTION OF ISSUE
    ======================
    The original JD Edwards EnterpriseOne Standalone (9.2.0.0) posted on the Oracle Software Delivery Cloud was missing next number data, thus making it impossible to perform transactional processes. i.e. Sales Order Entry

    RESOLUTION:
    ======================

    We have remastered JD Edwards EnterpriseOne Standalone (9.2.0.0). Please download the new images from the Oracle Software Delivery Cloud (OSDC) See screenshot of part numbers below.

    VN:F [1.9.22_1171]
    Rating: +1 (from 1 vote)
    1. JDEClouds

      Hi ALL,

      Oracle Standalone E920 is available for download now in http://www.edelivery.oracle.com

      I hope there is only one standalone setup file( V97803-01.zip is replaced for V100564-01.zip) has been changed out of 4 setup files to fix the F0002 and F00022 empty issue.

      I have modified the article depends upon the latest Standalone Setup files.For fresh installation refer the article step by step that will help for installing JD Edwards Standalone E920 successfully.

      Tips : If you have already Installed Old Standalone E920, No need to uninstall the complete setup follow below steps to install New Standalone E920.

      1.uninstall the JD Edwards Standalone Client
      2.Uninstall Oracle Weblogic Server 12.1.3
      3.Download the Latest Standalone setup file and assemble the file as per the article
      4.Install Oracle Weblogic Server 12.1.3
      5.Install JD Edwards Standalone client

      VN:F [1.9.22_1171]
      Rating: +1 (from 1 vote)
  23. Prakhar Sharma

    There is an issue with E1Local DB install.

    Wanted to install everything on D:\ .
    But install of E1Local failed on D:\. All others installed ok on D:
    So got to install E1local on C:\ and rest on D:\ – Works good.

    VA:F [1.9.22_1171]
    Rating: 0 (from 2 votes)
    1. JDEClouds

      Hi Prakhar,

      Thanks for the information.However We have tried installing Standalone 9.2 on E Drive including E1local.

      Its working perfectly fine. There is no issue.In case if anyone wants to install everything on drive other than C, Its possible and works perfectly fine.

      Best Regards
      JDEE1Tips
      http://www.JDEE1Tips.com

      VN:F [1.9.22_1171]
      Rating: -1 (from 1 vote)
  24. MEHAR

    Hi All,

    How to install a fact-client for jde 9.2

    VA:F [1.9.22_1171]
    Rating: 0 (from 0 votes)
    1. JDEClouds

      Dear Mehar,

      Fat Client for E920 Installation process also same like E920 Standalone Installation.

      There are few key points needs to noted are below

      1. OC4J removed from E920 Fat client.
      2. When compare to standalone installation, Fat client Local web can be installed on Oracle Weblogic server 12.1.3 or IBM Websphere 8.5.5( Express or server for Developer).
      3. Install Manager needs to be executed from the Deployment Server share path (“E920DEP/E920_1/OneWorldclientInstall/InstallManager.exe)

      Follow the same steps mentioned in the article for installing E920 fat client, you will be able to install E920 Standalone successfully.

      VN:F [1.9.22_1171]
      Rating: 0 (from 0 votes)
  25. jerome

    Hi All,

    New instalation with new files, all is OK.

    Jerome

    VN:F [1.9.22_1171]
    Rating: 0 (from 0 votes)
  26. Prakhar Sharma

    One more issue which I encountered while doing DEMO install –
    Database crashes while doing E1 client install (impdb crash).
    Hence the work around was to rename impdb and expdb in 32 bit client (12.1.0). So that 64 bit client exe can be used (E1Local) – Doc ID 2016865.1
    May be others have not reported because of Path variable. As JDE is still 32 bit, I make cure 32 bit client is first in the list followed by 64 bit (E1Local).
    Example –
    D:\E920\DEMO\bin32;D:\E920\system\bin32;D:\app\client\psharma\product\12.1.0\client_1\BIN;C:\Oracle\E1Local\bin;%SystemRoot%\system32;%SystemRoot%;%SystemRoot%\System32\Wbem;%SYSTEMROOT%\System32\WindowsPowerShell\v1.0\
    Cheers,
    -Prakhar

    VA:F [1.9.22_1171]
    Rating: 0 (from 2 votes)
  27. ram_jde

    Hi All,
    Installed 9.2 Demo on Windows 7 Pro successfully. But when I start the client, I get a “unable to send message to security server”. I compared the 3 INI files with those of Jerome and they are fine.Turning on the LOGs show the following warning before the above error occurs:

    Jan 26 02:10:52.588000 – 1524/2764 MAIN_THREAD LIB0000624 – Warning: input string is not in a valid format
    Jan 26 02:10:52.588001 – 1524/2764 MAIN_THREAD LIB0000676 – DecodeBufferV1 failed to decrypt data
    Jan 26 02:10:52.588002 – 1524/2764 MAIN_THREAD LIB0000569 – WARNING!!! [SECURITY][Password] Password not encrypted in the INI

    Any ideas? Greatly appreciate your input.

    Thanks.

    VN:F [1.9.22_1171]
    Rating: 0 (from 0 votes)
  28. ram_jde

    Hi All,
    Installed 9.2 Demo on Windows 7 Pro successfully. But when I start the client, I get “unable to send message to security server” & “Failed to communicate with the security server” error messages. I compared the 3 INI files with those of Jerome and they are identical.Turning on the LOGs showed the following warning before the above error occurs:

    Jan 26 02:10:52.588000 – 1524/2764 MAIN_THREAD LIB0000624 – Warning: input string is not in a valid format
    Jan 26 02:10:52.588001 – 1524/2764 MAIN_THREAD LIB0000676 – DecodeBufferV1 failed to decrypt data
    Jan 26 02:10:52.588002 – 1524/2764 MAIN_THREAD LIB0000569 – WARNING!!! [SECURITY][Password] Password not encrypted in the INI

    Any ideas? Greatly appreciate your input.

    Thanks.

    VN:F [1.9.22_1171]
    Rating: 0 (from 0 votes)
    1. JDEClouds

      Hi Ram,

      Can you attach the complete jde.log?

      Best Regards
      JDEE1Tips
      http://www.JDEE1Tips.com

      VN:F [1.9.22_1171]
      Rating: 0 (from 0 votes)
  29. ram_jde

    Sure, here is the JDE log.
    1816/1908 MAIN_THREAD Wed Jan 27 17:00:54.924135 jdb_ctl.c4196
    Starting OneWorld

    1816/1908 MAIN_THREAD Wed Jan 27 17:01:09.666006 JDETOOLS.c3065
    LIB0000569 – WARNING!!! [SECURITY][Password] Password not encrypted in the INI

    1816/1908 MAIN_THREAD Wed Jan 27 17:02:09.679001 jdecsec.c2170
    JDENET Error = eConnectionFailed

    1816/1908 MAIN_THREAD Wed Jan 27 17:02:14.088001 jdecsec.c2706
    Failed to communicate with security server: Unable to send message to Security Server

    1816/1908 MAIN_THREAD Wed Jan 27 17:02:15.149001 jdecsec.c264
    Failed to validate user DEMO by password

    1816/1908 MAIN_THREAD Wed Jan 27 17:02:15.164002 jdb_ctl.c4902
    JDB1100018 – Failed to get past Security check

    1816/1908 MAIN_THREAD Wed Jan 27 17:02:16.116001 msc_signon.cpp227
    ValidateUser failed from SignOn

    I collected the debug logs as well, if you like to take a look at them.Pls let me know.

    Thank you.

    VN:F [1.9.22_1171]
    Rating: 0 (from 0 votes)
    1. JDEClouds

      Hi Ram,

      Thanks for the jde.log.

      We noticed the error message “JDENET Error = eConnectionFailed”. This means JD Edwards Standalone client is not able to reach the Security server (Your PC Name : 6017) for validating the User ID : DEMO Password. That leads to error message “Failed to validate user DEMO by password” and “JDB1100018 – Failed to get past Security check”.

      This could be because your Port (6017) is occupied by some other process or anti virus blocking to allocate the port.

      We need to troubleshoot the issue in this area. check your Port status using the command “netstat -ano”.

      Best Regards
      JDEE1Tips
      http://www.JDEE1Tips.com

      VN:F [1.9.22_1171]
      Rating: 0 (from 2 votes)
  30. ram_jde

    Hello,
    I don’t see this port is being used by any process/program. I have no antivirus installed yet.

    here’s the CMD output on ports.
    Active Connections

    Proto Local Address Foreign Address State PID
    TCP 0.0.0.0:135 0.0.0.0:0 LISTENING 832
    TCP 0.0.0.0:445 0.0.0.0:0 LISTENING 4
    TCP 0.0.0.0:1521 0.0.0.0:0 LISTENING 1796
    TCP 0.0.0.0:49152 0.0.0.0:0 LISTENING 520
    TCP 0.0.0.0:49153 0.0.0.0:0 LISTENING 924
    TCP 0.0.0.0:49154 0.0.0.0:0 LISTENING 164
    TCP 0.0.0.0:49165 0.0.0.0:0 LISTENING 636
    TCP 0.0.0.0:49166 0.0.0.0:0 LISTENING 1828
    TCP 0.0.0.0:49168 0.0.0.0:0 LISTENING 580
    TCP 0.0.0.0:49169 0.0.0.0:0 LISTENING 2888
    TCP 0.0.0.0:49450 0.0.0.0:0 LISTENING 3068
    TCP 127.0.0.1:49455 127.0.0.1:49456 ESTABLISHED 2948
    TCP 127.0.0.1:49456 127.0.0.1:49455 ESTABLISHED 2948
    TCP 192.168.0.9:139 0.0.0.0:0 LISTENING 4
    TCP 192.168.0.9:49476 216.137.43.184:443 TIME_WAIT 0
    TCP 192.168.0.9:49512 54.230.7.148:80 ESTABLISHED 2948
    TCP 192.168.0.9:49513 54.230.7.148:80 ESTABLISHED 2948
    TCP 192.168.0.9:49516 54.172.97.231:443 TIME_WAIT 0
    TCP 192.168.0.9:49518 52.35.117.237:443 TIME_WAIT 0
    TCP 192.168.0.9:49543 69.172.216.55:443 TIME_WAIT 0
    TCP 192.168.0.9:49549 199.30.80.32:80 TIME_WAIT 0
    TCP 192.168.0.9:49550 199.30.80.32:80 TIME_WAIT 0
    TCP 192.168.0.9:49553 69.172.216.55:443 TIME_WAIT 0
    TCP 192.168.0.9:49557 69.172.216.111:443 TIME_WAIT 0
    TCP 192.168.0.9:49565 199.59.149.201:443 ESTABLISHED 2948
    TCP 192.168.0.9:49567 208.111.158.203:443 TIME_WAIT 0
    TCP 192.168.0.9:49583 199.30.80.32:80 TIME_WAIT 0
    TCP 192.168.0.9:49584 199.30.80.32:80 TIME_WAIT 0
    TCP 192.168.0.9:49585 199.30.80.32:80 TIME_WAIT 0
    TCP 192.168.0.9:49587 70.42.104.18:80 TIME_WAIT 0
    TCP 192.168.0.9:49593 208.111.158.203:443 TIME_WAIT 0
    TCP 192.168.0.9:49594 63.245.213.48:443 TIME_WAIT 0
    TCP [::]:135 [::]:0 LISTENING 832
    TCP [::]:445 [::]:0 LISTENING 4
    TCP [::]:1521 [::]:0 LISTENING 1796
    TCP [::]:49152 [::]:0 LISTENING 520
    TCP [::]:49153 [::]:0 LISTENING 924
    TCP [::]:49154 [::]:0 LISTENING 164
    TCP [::]:49165 [::]:0 LISTENING 636
    TCP [::]:49166 [::]:0 LISTENING 1828
    TCP [::]:49168 [::]:0 LISTENING 580
    TCP [::]:49169 [::]:0 LISTENING 2888
    TCP [::1]:1521 [::1]:49167 ESTABLISHED 1796
    TCP [::1]:49155 [::]:0 LISTENING 1796
    TCP [::1]:49167 [::1]:1521 ESTABLISHED 1828
    TCP [2605:6000:3e1c:3700:45b5:ab46:b97f:ff3c]:49457 [2607:f8b0:4000:807::1
    014]:80 ESTABLISHED 2948
    TCP [2605:6000:3e1c:3700:45b5:ab46:b97f:ff3c]:49459 [2607:f8b0:4003:c14::6
    4]:80 TIME_WAIT 0
    TCP [2605:6000:3e1c:3700:45b5:ab46:b97f:ff3c]:49466 [2400:cb00:2048:1::681
    c:411]:80 TIME_WAIT 0
    TCP [2605:6000:3e1c:3700:45b5:ab46:b97f:ff3c]:49488 [2607:f8b0:4003:c0c::7
    6]:80 TIME_WAIT 0
    TCP [2605:6000:3e1c:3700:45b5:ab46:b97f:ff3c]:49490 [2607:f8b0:4003:c12::8
    a]:80 TIME_WAIT 0
    TCP [2605:6000:3e1c:3700:45b5:ab46:b97f:ff3c]:49510 [2607:f8b0:4003:c06::6
    6]:80 ESTABLISHED 2948
    TCP [2605:6000:3e1c:3700:45b5:ab46:b97f:ff3c]:49515 [2a03:2880:f013:1e:fac
    e:b00c:0:25de]:443 ESTABLISHED 2948
    TCP [2605:6000:3e1c:3700:45b5:ab46:b97f:ff3c]:49525 [2a03:2880:f013:8:face
    :b00c:0:1]:443 ESTABLISHED 2948
    TCP [2605:6000:3e1c:3700:45b5:ab46:b97f:ff3c]:49526 [2a03:2880:f013:8:face
    :b00c:0:1]:443 ESTABLISHED 2948
    TCP [2605:6000:3e1c:3700:45b5:ab46:b97f:ff3c]:49533 [2607:f8b0:4000:801::2
    002]:80 TIME_WAIT 0
    TCP [2605:6000:3e1c:3700:45b5:ab46:b97f:ff3c]:49552 [2600:1404:a:482::201a
    ]:80 TIME_WAIT 0
    TCP [2605:6000:3e1c:3700:45b5:ab46:b97f:ff3c]:49569 [2607:f8b0:4003:c12::8
    a]:80 TIME_WAIT 0
    TCP [2605:6000:3e1c:3700:45b5:ab46:b97f:ff3c]:49570 [2607:f8b0:4003:c14::7
    6]:80 TIME_WAIT 0
    TCP [2605:6000:3e1c:3700:45b5:ab46:b97f:ff3c]:49571 [2400:cb00:2048:1::c62
    9:d643]:80 TIME_WAIT 0
    TCP [2605:6000:3e1c:3700:45b5:ab46:b97f:ff3c]:49572 [2620:109:c002::6cae:a
    0a]:443 TIME_WAIT 0
    TCP [2605:6000:3e1c:3700:45b5:ab46:b97f:ff3c]:49577 [2607:f8b0:4003:c0d::5
    f]:80 ESTABLISHED 2948
    TCP [2605:6000:3e1c:3700:45b5:ab46:b97f:ff3c]:49578 [2607:f8b0:4003:c0d::5
    f]:80 TIME_WAIT 0
    TCP [2605:6000:3e1c:3700:45b5:ab46:b97f:ff3c]:49580 [2607:f8b0:4003:c0c::5
    e]:80 ESTABLISHED 2948
    TCP [2605:6000:3e1c:3700:45b5:ab46:b97f:ff3c]:49590 [2600:1404:a:48b::201a
    ]:80 ESTABLISHED 2948
    TCP [2605:6000:3e1c:3700:45b5:ab46:b97f:ff3c]:49591 [2600:1404:a:48b::201a
    ]:80 TIME_WAIT 0
    TCP [2605:6000:3e1c:3700:45b5:ab46:b97f:ff3c]:49592 [2606:2800:220:131d:1d
    30:1f1d:238b:1e56]:80 TIME_WAIT 0
    UDP 0.0.0.0:68 *:* 924
    UDP 0.0.0.0:500 *:* 164
    UDP 0.0.0.0:4500 *:* 164
    UDP 0.0.0.0:5355 *:* 1248
    UDP 0.0.0.0:56243 *:* 3068
    UDP 127.0.0.1:1900 *:* 2736
    UDP 127.0.0.1:55373 *:* 2736
    UDP 192.168.0.9:137 *:* 4
    UDP 192.168.0.9:138 *:* 4
    UDP 192.168.0.9:1900 *:* 2736
    UDP 192.168.0.9:55372 *:* 2736
    UDP [::]:500 *:* 164
    UDP [::]:4500 *:* 164
    UDP [::]:5355 *:* 1248
    UDP [::1]:1900 *:* 2736
    UDP [::1]:55371 *:* 2736
    UDP [fe80::6492:80bd:c0fb:2af1%12]:1900 *:*
    2736
    UDP [fe80::6492:80bd:c0fb:2af1%12]:55370 *:*
    2736

    Pls advise. Sorry for using public space, we can chat offline if you prefer. Thanks for your prompt replies.

    VN:F [1.9.22_1171]
    Rating: 0 (from 0 votes)
  31. ram_jde

    You guys are AWESOME. Thanks for resolving the issue with the installation so promptly.

    Thanks again.

    VN:F [1.9.22_1171]
    Rating: +2 (from 2 votes)
    1. grand_national

      I’ve performed the installation process twice on 2 virtual machines.
      Both times, the web works fine but I can’t launch any local fat client apps.
      The screens open with panes defined, but the new window for the app, just goes to a not responding state.
      Any suggestions?

      VN:F [1.9.22_1171]
      Rating: 0 (from 0 votes)
  32. venkatesh

    HI,

    Installed JDE demo 9.2 in windows 10 and unable to locate security server.

    PF the JDE.log.

    3912/9032 MAIN_THREAD Mon Apr 25 19:32:22.786000 jdb_ctl.c4196
    Starting OneWorld

    3912/9032 MAIN_THREAD Mon Apr 25 19:32:27.249000 JDETOOLS.c3065
    LIB0000569 – WARNING!!! [SECURITY][Password] Password not encrypted in the INI

    3220/7780 UNKNOWN Mon Apr 25 19:32:27.280000 jdeksec.c786
    INITIALIZING SECURITY SERVER KERNEL

    3220/7780 UNKNOWN Mon Apr 25 19:32:27.280001 jdeksec.c803
    WARNING – failed to find site keys in JDE.INI

    3220/7780 UNKNOWN Mon Apr 25 19:32:27.280002 JDETOOLS.c3065
    LIB0000569 – WARNING!!! [SECURITY][Password] Password not encrypted in the INI

    3220/7780 UNKNOWN Mon Apr 25 19:32:27.296000 netpub.c999
    JDENet already initialized

    3220/7780 UNKNOWN Mon Apr 25 19:32:27.296001 jdb_ctl.c3121
    Net init failed or not initialized

    3220/7780 UNKNOWN Mon Apr 25 19:32:27.343000 JDETOOLS.c3065
    LIB0000569 – WARNING!!! [SECURITY][Password] Password not encrypted in the INI

    3220/7780 UNKNOWN Mon Apr 25 19:32:37.031000 dbinitcn.c775
    OCI0000374 – Failed to connect to the database instance

    3220/7780 UNKNOWN Mon Apr 25 19:32:37.031001 dbinitcn.c780
    OCI0000375 – Error – ORA-12154: TNS:could not resolve the connect identifier specified

    3220/7780 UNKNOWN Mon Apr 25 19:32:37.031002 dbinitcn.c449
    OCI0000064 – Unable to create database server connection

    3220/7780 UNKNOWN Mon Apr 25 19:32:37.031003 dbinitcn.c542
    OCI0000367 – Unable to connect to Oracle ORA-12154: TNS:could not resolve the connect identifier specified

    3220/7780 UNKNOWN Mon Apr 25 19:32:37.031004 jdb_drvm.c798
    JDB9900164 – Failed to connect to E1Local

    3220/7780 UNKNOWN Mon Apr 25 19:32:37.031005 JTP_CM.c282
    JDB9909003 – Could not init connect.

    3220/7780 UNKNOWN Mon Apr 25 19:32:37.031006 JTP_TM.c1140
    JDB9909100 – Get connect info failed: Transaction ID =

    3220/7780 UNKNOWN Mon Apr 25 19:32:37.031007 jdb_rq1.c2458
    JDB3100013 – Failed to get connectinfo

    3220/7780 UNKNOWN Mon Apr 25 19:32:37.031008 jdb_omp1.c3369
    JDB9900257 – Failed to open F986101

    3220/7780 UNKNOWN Mon Apr 25 19:32:46.067000 dbinitcn.c775
    OCI0000374 – Failed to connect to the database instance

    3220/7780 UNKNOWN Mon Apr 25 19:32:46.067001 dbinitcn.c780
    OCI0000375 – Error – ORA-12154: TNS:could not resolve the connect identifier specified

    3220/7780 UNKNOWN Mon Apr 25 19:32:46.067002 dbinitcn.c449
    OCI0000064 – Unable to create database server connection

    3220/7780 UNKNOWN Mon Apr 25 19:32:46.067003 dbinitcn.c542
    OCI0000367 – Unable to connect to Oracle ORA-12154: TNS:could not resolve the connect identifier specified

    3220/7780 UNKNOWN Mon Apr 25 19:32:46.067004 jdb_drvm.c798
    JDB9900164 – Failed to connect to E1Local

    3220/7780 UNKNOWN Mon Apr 25 19:32:46.067005 JTP_CM.c282
    JDB9909003 – Could not init connect.

    3220/7780 UNKNOWN Mon Apr 25 19:32:46.067006 JTP_TM.c1140
    JDB9909100 – Get connect info failed: Transaction ID =

    3220/7780 UNKNOWN Mon Apr 25 19:32:46.067007 jdb_rq1.c2458
    JDB3100013 – Failed to get connectinfo

    3220/7780 UNKNOWN Mon Apr 25 19:32:46.067008 jdb_omp1.c1220
    JDB9900240 – Failed to open F986101

    3220/7780 UNKNOWN Mon Apr 25 19:32:46.067009 jdb_cach.c1369
    JDB9900009 – Failed to load ObjectMap Cache

    3220/7780 UNKNOWN Mon Apr 25 19:32:46.067010 jdb_cach.c1386
    Unable to load primary Object Configuration Manager – switching to secondary

    3220/7780 UNKNOWN Mon Apr 25 19:32:46.067011 jdb_omp1.c651
    JDB9900247 – Failed to find F98611 System Local in cache

    3220/7780 UNKNOWN Mon Apr 25 19:32:46.067012 jdb_rq1.c2023
    JDB3100011 – Failed to get location of table F986101 for environment DEMO920

    3220/7780 UNKNOWN Mon Apr 25 19:32:46.067013 jdb_omp1.c3369
    JDB9900257 – Failed to open F986101

    3220/7780 UNKNOWN Mon Apr 25 19:32:46.067014 jdb_omp1.c651
    JDB9900247 – Failed to find F98611 System Local in cache

    3220/7780 UNKNOWN Mon Apr 25 19:32:46.067015 jdb_rq1.c2023
    JDB3100011 – Failed to get location of table F986101 for environment DEMO920

    3220/7780 UNKNOWN Mon Apr 25 19:32:46.067016 jdb_omp1.c1220
    JDB9900240 – Failed to open F986101

    3220/7780 UNKNOWN Mon Apr 25 19:32:46.067017 jdb_cach.c1369
    JDB9900009 – Failed to load ObjectMap Cache

    3220/7780 UNKNOWN Mon Apr 25 19:32:46.067018 jdb_omp1.c629
    JDB9900246 – Failed to find existence of default OMAP for environment DEMO920

    3220/7780 UNKNOWN Mon Apr 25 19:32:46.067019 jdb_rq1.c2023
    JDB3100011 – Failed to get location of table F00921 for environment DEMO920

    3220/7780 UNKNOWN Mon Apr 25 19:32:46.067020 jdecgsc.c201
    MSC0000028 – Could not load F00921 cache

    3220/7780 UNKNOWN Mon Apr 25 19:32:46.067021 jdb_rq1.c3061
    JDB2700019 – Failed to get data source for the table

    3220/7780 UNKNOWN Mon Apr 25 19:32:46.082000 jdb_omp1.c629
    JDB9900246 – Failed to find existence of default OMAP for environment DEMO920

    3220/7780 UNKNOWN Mon Apr 25 19:32:46.082001 jdb_rq1.c2023
    JDB3100011 – Failed to get location of table F00941 for environment DEMO920

    3220/7780 UNKNOWN Mon Apr 25 19:32:46.082002 jdb_ctl.c819
    JDB9900408 – Failed to get package release level

    3220/7780 UNKNOWN Mon Apr 25 19:32:46.082003 jdb_ctl.c4439
    JDB1100016 – Failed to load Environment – DEMO920

    3220/7780 UNKNOWN Mon Apr 25 19:32:46.082004 jdb_omp1.c629
    JDB9900246 – Failed to find existence of default OMAP for environment DEMO920

    3220/7780 UNKNOWN Mon Apr 25 19:32:46.082005 jdb_rq1.c2023
    JDB3100011 – Failed to get location of table F00941 for environment DEMO920

    3220/7780 UNKNOWN Mon Apr 25 19:32:46.082006 jdb_omp1.c629
    JDB9900246 – Failed to find existence of default OMAP for environment DEMO920

    3220/7780 UNKNOWN Mon Apr 25 19:32:46.082007 jdb_rq1.c2023
    JDB3100011 – Failed to get location of table F00942 for environment DEMO920

    3220/7780 UNKNOWN Mon Apr 25 19:32:46.082008 SpecUtil.c5156
    JDESPEC0000051 – Unable to open F00942 to load metadata cache. Fatal Error.

    3220/7780 UNKNOWN Mon Apr 25 19:32:46.082009 SpecUtil.c5195
    JDESPEC0000052 – Unable to select all records from F00942 to load metadata cache. Fatal Error.

    3220/7780 UNKNOWN Mon Apr 25 19:32:46.082010 SpecUtil.c5068
    Metadata release cache handle destroyed before it could be used. System probably being shut down. Returning failure.

    3220/7780 UNKNOWN Mon Apr 25 19:32:46.082011 SpecOpen.c1845
    JDESPEC0000059 – Unable to determine spec release level of the data source DEMO. Cannot determine metadata format version of this path code. Cannot acccess metadata (specs)! Fatal Error.

    3220/7780 UNKNOWN Mon Apr 25 19:32:46.082012 SpecOpen.c2633
    jdeSpecOpenLocal completed in error – JDESPECRESULT_FAILED.

    3220/7780 UNKNOWN Mon Apr 25 19:32:46.082013 evtcache.c890
    isNewRTESystemEnabled – DDTABL spec handle cannot be accessed.

    3220/7780 WRK:Starting jdeCallObject Mon Apr 25 19:32:46.082014 jdb_omp1.c629
    JDB9900246 – Failed to find existence of default OMAP for environment DEMO920

    3220/7780 WRK:Starting jdeCallObject Mon Apr 25 19:32:46.082015 jdb_rq1.c2023
    JDB3100011 – Failed to get location of table F00942 for environment DEMO920

    3220/7780 WRK:Starting jdeCallObject Mon Apr 25 19:32:46.082016 SpecUtil.c5156
    JDESPEC0000051 – Unable to open F00942 to load metadata cache. Fatal Error.

    3220/7780 WRK:Starting jdeCallObject Mon Apr 25 19:32:46.082017 SpecUtil.c5195
    JDESPEC0000052 – Unable to select all records from F00942 to load metadata cache. Fatal Error.

    3220/7780 WRK:Starting jdeCallObject Mon Apr 25 19:32:46.082018 SpecUtil.c5068
    Metadata release cache handle destroyed before it could be used. System probably being shut down. Returning failure.

    3220/7780 WRK:Starting jdeCallObject Mon Apr 25 19:32:46.082019 SpecOpen.c1845
    JDESPEC0000059 – Unable to determine spec release level of the data source DEMO. Cannot determine metadata format version of this path code. Cannot acccess metadata (specs)! Fatal Error.

    3220/7780 WRK:Starting jdeCallObject Mon Apr 25 19:32:46.082020 SpecOpen.c2633
    jdeSpecOpenLocal completed in error – JDESPECRESULT_FAILED.

    3220/7780 WRK:Starting jdeCallObject Mon Apr 25 19:32:46.098000 secutil.c422
    Failed to init security bootstrap environment using user=DEMO, env=DEMO920, role=*ALL

    3220/7780 WRK:Starting jdeCallObject Mon Apr 25 19:32:46.098001 jdeksec.c3864
    Failed to init Env

    3220/7780 WRK:Starting jdeCallObject Mon Apr 25 19:32:46.098002 netflow.c1219
    Dispatch Function ‘[email protected]’ returned failure on eNetDispatchInit

    3912/9032 MAIN_THREAD Mon Apr 25 19:33:47.286000 jdecsec.c2219
    JDENET Error = eTimeOut

    3912/9032 MAIN_THREAD Mon Apr 25 19:41:28.684000 jdecsec.c2706
    Failed to communicate with security server: Unable to locate Security Server

    3912/9032 MAIN_THREAD Mon Apr 25 19:41:29.793000 jdecsec.c264
    Failed to validate user DEMO by password

    3912/9032 MAIN_THREAD Mon Apr 25 19:41:29.809000 jdb_ctl.c4902
    JDB1100018 – Failed to get past Security check

    3912/9032 MAIN_THREAD Mon Apr 25 19:41:30.553000 msc_signon.cpp227
    ValidateUser failed from SignOn

    VA:F [1.9.22_1171]
    Rating: 0 (from 2 votes)
    1. JDEClouds

      This could be because of multiple reasons. However you can resolve the issue by following below steps

      1. Go to Services and check for services OracleServiceE1local and OracleE1LocalTNSListener

      2. Navigate to the below location ( C:\Oracle\E1Local\NETWORK\ADMIN)

      Make sure to select listener.ora & tnsnames.ora have the value for Host as actual Hostname (Instead of IP or Localhost) in both the files

      3. Stop and restart the OracleE1LocalTNSListener and try to login into Standalone client

      VN:F [1.9.22_1171]
      Rating: 0 (from 0 votes)
      1. JulianoChamp

        Hello guys,
        First of all, thank you for all your support! I really appreciate
        I installed the Standalone in Windows 7 64 bits and I’m getting the same issue than venkatesh, with the same .log error messages.
        I tried the tip above, and also I tried the tip in the Troubleshooting Guide page and unfortunately the error persist.
        Does anybody have other idea?

        VN:F [1.9.22_1171]
        Rating: 0 (from 0 votes)
        1. JDEClouds

          Give us the alert log from the below location “C:\Oracle\diag\rdbms\e1local\e1local\alert\log.xml” to understand the issue and help you better !

          VN:F [1.9.22_1171]
          Rating: +1 (from 1 vote)
          1. mariordz

            Hello JDEE1Tips..

            Im facing the same problem with “unable to locate security server”, I have checked your recommendations but I’m still with this error.. I drop you my log file bye email, to see if you can help me with this.

            Thank you
            Mario

            VN:F [1.9.22_1171]
            Rating: 0 (from 0 votes)
  33. David Terborg

    I’m wondering if it would be interesting to upload a working VM JDE9.2???

    VN:F [1.9.22_1171]
    Rating: 0 (from 0 votes)
  34. KalpeshJadhav

    I facing “impdp.exe has stopped working” issue… I tried at leat 5-6 times to install JDE 9.2 demo and still error is not resolved. Can it be resolved?

    VN:F [1.9.22_1171]
    Rating: 0 (from 0 votes)
    1. JDEClouds

      Hi,

      Check your environment variable –>Path X:\app\oracle\product\12.1.0\client_1\bin is in first before C:\Oracle\E1Local\bin.

      If yes then you will face this issue.

      Regards
      JDEE1Tips

      VN:F [1.9.22_1171]
      Rating: 0 (from 0 votes)
    2. fishoutofwater

      Hi,
      Oracle has noted that there is a problem with IMPDP.exe and EXPDP.exe in their 12c database client software.
      The solution: Ensure that both the 32-bit client and the 64-bit client are both in your PATH. (ie: c:\app\oracle\product\12.1.0\client_1\bin;C:\Oracle\E1Local\bin). Rename the impdp.exe and expdp.exe in the c:\app\oracle\product\12.1.0\client_1\bin folder to impdp.exe.bak and expdp.exe.bak. The install will then use the impdp.exe from the database install and everything will work.

      VN:F [1.9.22_1171]
      Rating: 0 (from 0 votes)
      1. JDEClouds

        Hi,

        Thanks for the comment !
        We have a added the comment in the article.

        VN:F [1.9.22_1171]
        Rating: -1 (from 1 vote)
  35. Raj_00

    Hello,

    Thanks for the wonderful tutorial…
    I am facing the below issue when I try to install 5. Install E1Local 12c DB….Request your help!!!

    EnterpriseOne Local Oracle Database:
    Summary
    ——————————————————————————————————————————————————
    OS Version Unknown (VER_PLATFORM_WIN32_NT 6.0)
    Installer Version Can’t determine version: In debug mode
    Launch String Cannot Determine Launch String
    Launch Time Sunday, June 12, 2016 02:00 AM
    ——————————————————————————————————————————————————~~~
    Line# Msg# Time Level Message
    ——————————————————————————————————————————————————
    1 1 02:00:30 I Setting current directory: D:\Standalone\ThirdParty\ORACLE\
    2 1 02:00:30 I
    Could not find registry key \\HKEY_LOCAL_MACHINE\SYSTEM\CurrentControlSet\services\OracleServiceE1Local. The Oracle database E1Local is not installed.
    3 1 02:01:23 I
    Oracle is not installed – will install it.

    4 1 02:01:23 I Oracle Home User is “NonAdmin”

    5 1 02:01:23 I CreateSetupRspFile(): C:\Users\Lenovo\AppData\Local\Temp\db_install.rsp
    6 1 02:01:26 I Cab_Decompression: Starting decompression of the cab files.

    7 1 02:01:26 I Cab_Decompression: Destination directory for extracting cab file is C:\Oracle\E1Local\.

    8 1 02:01:26 I Cab_Decompression: Open cabinet file D:\Standalone\ThirdParty\ORACLE\E1Local12c.cab.

    9 1 02:01:26 I Cab_Decompression: The compressed file to extract is D:\Standalone\ThirdParty\ORACLE\E1Local12c.cab.

    10 1 02:03:53 I Cab_Decompression: The compressed file to extract is D:\Standalone\ThirdParty\ORACLE\E1Local12c2.CAB.

    11 1 02:04:03 I Cab_Decompression: The compressed file to extract is D:\Standalone\ThirdParty\ORACLE\E1Local12c3.CAB.

    12 1 02:04:07 I Cab_Decompression: The compressed file to extract is D:\Standalone\ThirdParty\ORACLE\E1Local12c4.CAB.

    13 1 02:05:13 I Cab_Decompression: The compressed file to extract is D:\Standalone\ThirdParty\ORACLE\E1Local12c7.CAB.

    14 1 02:05:55 I Cab_Decompression: The compressed file to extract is D:\Standalone\ThirdParty\ORACLE\E1Local12c8.CAB.

    15 1 02:06:28 I Cab_Decompression: The compressed file to extract is D:\Standalone\ThirdParty\ORACLE\E1Local12c9.CAB.

    16 1 02:07:25 I Cab_Decompression: The compressed file to extract is D:\Standalone\ThirdParty\ORACLE\E1Local12c10.CAB.

    17 1 02:08:28 I Cab_Decompression: The compressed file to extract is D:\Standalone\ThirdParty\ORACLE\E1Local12c11.CAB.

    18 1 02:09:28 I Cab_Decompression: The compressed file to extract is D:\Standalone\ThirdParty\ORACLE\E1Local12c12.CAB.

    19 1 02:10:21 I Cab_Decompression: The compressed file to extract is D:\Standalone\ThirdParty\ORACLE\E1Local12c13.CAB.

    20 1 02:11:21 I Cab_Decompression: The compressed file to extract is D:\Standalone\ThirdParty\ORACLE\E1Local12c14.CAB.

    21 1 02:12:08 I Cab_Decompression: The compressed file to extract is D:\Standalone\ThirdParty\ORACLE\E1Local12c15.CAB.

    22 1 02:12:57 I Cab_Decompression: The compressed file to extract is D:\Standalone\ThirdParty\ORACLE\E1Local12c16.CAB.

    23 1 02:14:03 I Cab_Decompression: The compressed file to extract is D:\Standalone\ThirdParty\ORACLE\E1Local12c17.CAB.

    24 1 02:15:02 I Cab_Decompression: The compressed file to extract is D:\Standalone\ThirdParty\ORACLE\E1Local12c18.CAB.

    25 1 02:16:04 I Cab_Decompression: The compressed file to extract is D:\Standalone\ThirdParty\ORACLE\E1Local12c19.CAB.

    26 1 02:16:18 I Cab_Decompression: The compressed file to extract is D:\Standalone\ThirdParty\ORACLE\E1Local12c20.CAB.

    27 1 02:16:32 I Installing Oracle.
    28 1 02:16:32 I Installing Oracle Database Engine….
    29 1 02:16:33 I Installing Oracle Database Engine with command: C:\Oracle\E1Local\oui\bin\setup.exe -silent -responseFile C:\Users\Lenovo\AppData\Local\Temp\db_install.rsp -nowait -clone -nobackground -waitforcompletion -force ORACLE_BASE=C:\Oracle ORACLE_HOME=C:\Oracle\E1Local ORACLE_HOME_NAME=E1Local
    30 1 02:22:03 I Uninstalling Oracle Net Listener….
    31 1 02:22:03 I Uninstalling Oracle Net Listener with command: C:\Oracle\E1Local\bin\netca.bat /deinst
    32 1 02:22:16 I Installing Oracle Net Listener….
    33 1 02:22:16 I Installing Oracle Net Listener with command: C:\Oracle\E1Local\bin\netca.bat /silent /responsefile C:\Users\Lenovo\AppData\Local\Temp\netca.rsp /SERVICEUSERPASSWORD “******”
    34 1 02:22:41 I Setting up SQLNET Authentication Services.
    35 1 02:22:41 I SQLNET file: C:\Oracle\E1Local\NETWORK\ADMIN\sqlnet.ora
    36 1 02:22:42 I Installing Oracle seed database.
    37 1 02:22:42 I Installing the Oracle seed database with command: C:\Oracle\E1Local\bin\dbca.bat -silent -createdatabase -templatename C:\Oracle\E1Local\assistants\dbca\templates\E1Local.dbc -gdbname E1Local -SID E1Local -sysPassword ****** -systemPassword ****** -SERVICEUSERPASSWORD “******”
    38 1 02:22:52 E : The command failed with error 1.
    Install Time: 00 hours, 22 mins, 31 secs.

    Thanks & Awaiting reply!!

    VN:F [1.9.22_1171]
    Rating: 0 (from 0 votes)
    1. JDEClouds

      Hey Raj,

      Thanks for your appreciation !

      Attach the log from below location “C:\Oracle\cfgtoollogs”, we will try to help you.

      VN:F [1.9.22_1171]
      Rating: +1 (from 1 vote)
      1. Raj_00

        Thanks for the reply!!
        Pls find the log below:

        E1Local0.log:

        Unique database identifier check passed.

        C:\ has enough space. Required space is 3505 MB , available space is 133885 MB.
        Specified file “C:\ORACLE\ORADATA\E1LOCAL\SYSAUX01.DBF” already exists.
        Specified file “C:\ORACLE\ORADATA\E1LOCAL\UNDOTBS01.DBF” already exists.
        Specified file “C:\ORACLE\ORADATA\E1LOCAL\SYSTEM01.DBF” already exists.
        Specified file “C:\ORACLE\ORADATA\E1LOCAL\USERS01.DBF” already exists.
        Specified file “C:\ORACLE\ORADATA\E1LOCAL\TEMP01.DBF” already exists.

        trace.log_E1Local_2016-06-12_02-22-50-AM:

        [main] [ 2016-06-12 02:22:50.265 IST ] [Host.:1095] Begin tracing..
        [main] [ 2016-06-12 02:22:50.374 IST ] [OsUtilsBase.getBaseFromOrabase:659] oraBaseUtility C:\Oracle\E1Local\bin\orabase.exe
        [main] [ 2016-06-12 02:22:50.374 IST ] [OsUtilsBase.getBaseFromOrabase:668] cmds: C:\Oracle\E1Local\bin\orabase.exe
        [main] [ 2016-06-12 02:22:50.374 IST ] [OsUtilsBase.getBaseFromOrabase:672] envs: ORACLE_HOME=C:\Oracle\E1Local
        [main] [ 2016-06-12 02:22:50.499 IST ] [OsUtilsBase.getBaseFromOrabase:682] baseLocation from orabase
        C:\Oracle
        [main] [ 2016-06-12 02:22:50.499 IST ] [OsUtilsBase.getBaseFromOrabase:707] orabaseLocation= C:\Oracle
        [main] [ 2016-06-12 02:22:50.499 IST ] [SilentHost.initialize:187] SilentHost-> initialize: m_tempLogFile = C:\Oracle\cfgtoollogs\dbca\silent.log_2016-06-12_02-22-50-AM
        [main] [ 2016-06-12 02:22:50.514 IST ] [Host.checkIfBigClusterAndHubNode:1715] Not a cluster environment: exiting BigCluster Check
        [main] [ 2016-06-12 02:22:50.514 IST ] [InventoryUtil.getOracleBase:149] Getting ORACLE_BASE from inventory.
        [main] [ 2016-06-12 02:22:50.514 IST ] [InventoryUtil.getOUIInvSession:349] setting OUI READ level to ACCESSLEVEL_READ_LOCKLESS
        [main] [ 2016-06-12 02:22:50.514 IST ] [InventoryUtil.getOracleBase:164] Inventory Home Size = 1
        [main] [ 2016-06-12 02:22:50.514 IST ] [InventoryUtil.getOracleBase:189] ORACLE_BASE returned from inventory:= C:\Oracle
        [main] [ 2016-06-12 02:22:50.514 IST ] [Host.displayOracleBaseWarning:1755] oracleBaseFromEnv null
        [main] [ 2016-06-12 02:22:50.514 IST ] [Host.displayOracleBaseWarning:1761] oracle_base from OUI C:\Oracle oracle_base from envnull
        [main] [ 2016-06-12 02:22:50.530 IST ] [InventoryUtil.getOUIInvSession:349] setting OUI READ level to ACCESSLEVEL_READ_LOCKLESS
        [main] [ 2016-06-12 02:22:50.530 IST ] [InventoryUtil.isCRSHome:386] Homeinfo C:\Oracle\E1Local,1
        [main] [ 2016-06-12 02:22:50.780 IST ] [Host.validateGridHome:3883] Validation false
        [main] [ 2016-06-12 02:22:50.780 IST ] [Host.startOperation:2400] Source db null
        [main] [ 2016-06-12 02:22:50.780 IST ] [Host.startOperation:2401] GDB Name E1Local
        [main] [ 2016-06-12 02:22:50.826 IST ] [Host.startOperation:2402] MgmtDB sid -MGMTDB
        [main] [ 2016-06-12 02:22:50.826 IST ] [Host.startOperation:2403] MgmtDB name _mgmtdb
        [main] [ 2016-06-12 02:22:50.826 IST ] [HADatabaseUtils.isGridMgmtDB:2846] Mgmt DBName from srvm _mgmtdb
        [main] [ 2016-06-12 02:22:50.904 IST ] [OracleHome.getTZVersionFromReadMe:484] part read from file Current Structure version
        [main] [ 2016-06-12 02:22:50.904 IST ] [OracleHome.getTZVersionFromReadMe:484] part read from file 3
        [main] [ 2016-06-12 02:22:50.904 IST ] [OracleHome.getTZVersionFromReadMe:484] part read from file Current Content Version
        [main] [ 2016-06-12 02:22:50.904 IST ] [OracleHome.getTZVersionFromReadMe:502] ************get tz version from file 18
        [main] [ 2016-06-12 02:22:50.904 IST ] [Host.checkOPS:2087] Inside checkOPS
        [main] [ 2016-06-12 02:22:50.904 IST ] [Host.checkOPS:2099] Trying to check cluster existence
        [main] [ 2016-06-12 02:22:50.904 IST ] [Host.checkOPS:2104] cluster existence:false
        [main] [ 2016-06-12 02:22:50.904 IST ] [Host.checkOPS:2113] Cluster Installed false
        [main] [ 2016-06-12 02:22:50.904 IST ] [Host.checkOPS:2129] Cluster installed=false
        [main] [ 2016-06-12 02:22:51.279 IST ] [TemplateManager.validateTemplate:636] Validation of template is succussful
        [main] [ 2016-06-12 02:22:51.294 IST ] [HADatabaseUtils.isGridMgmtDB:2846] Mgmt DBName from srvm _mgmtdb
        [main] [ 2016-06-12 02:22:51.294 IST ] [HAUtils.getCurrentOracleHome:593] Oracle home from system property: C:\Oracle\E1Local
        [main] [ 2016-06-12 02:22:51.294 IST ] [HAUtils.getConfiguredGridHome:1343] —– Getting CRS HOME —-
        [main] [ 2016-06-12 02:22:51.294 IST ] [WindowsSystem.getCRSHome:1809] olrKey = HKEY_LOCAL_MACHINE\Software\Oracle\Olr
        [main] [ 2016-06-12 02:22:51.294 IST ] [WindowsSystem.regKeyExists:1343] WindowsSystem.regKeyExists: mainkey= HKEY_LOCAL_MACHINE subkey = Software\Oracle\Olr
        [main] [ 2016-06-12 02:22:51.326 IST ] [HAUtils.getHASHome:1500] Failed to get HAS home.
        PRCI-1144 : Failed to retrieve Oracle Grid Infrastructure home path
        PRKN-1036 : Windows registry key “HKEY_LOCAL_MACHINE\Software\Oracle\Olr” not found on node “localnode”
        [main] [ 2016-06-12 02:22:51.326 IST ] [NetworkUtils.getAllListeners:372] Adding DBHome listener: LISTENER
        [main] [ 2016-06-12 02:22:51.326 IST ] [NetworkUtils.getOneLocalListenerProtocolAddress:3111] lsnr LISTENER
        [main] [ 2016-06-12 02:22:51.326 IST ] [HAUtils.getCurrentOracleHome:593] Oracle home from system property: C:\Oracle\E1Local
        [main] [ 2016-06-12 02:22:51.326 IST ] [HAUtils.getConfiguredGridHome:1343] —– Getting CRS HOME —-
        [main] [ 2016-06-12 02:22:51.326 IST ] [WindowsSystem.getCRSHome:1809] olrKey = HKEY_LOCAL_MACHINE\Software\Oracle\Olr
        [main] [ 2016-06-12 02:22:51.326 IST ] [WindowsSystem.regKeyExists:1343] WindowsSystem.regKeyExists: mainkey= HKEY_LOCAL_MACHINE subkey = Software\Oracle\Olr
        [main] [ 2016-06-12 02:22:51.326 IST ] [HAUtils.getHASHome:1500] Failed to get HAS home.
        PRCI-1144 : Failed to retrieve Oracle Grid Infrastructure home path
        PRKN-1036 : Windows registry key “HKEY_LOCAL_MACHINE\Software\Oracle\Olr” not found on node “localnode”
        [main] [ 2016-06-12 02:22:51.341 IST ] [NetworkUtils.getOneLocalListenerProtocolAddress:3276] host=null hostParam=192.168.0.5
        [main] [ 2016-06-12 02:22:51.341 IST ] [NetworkUtils.getOneLocalListenerProtocolAddress:3342] returning bestAddrSoFar=(ADDRESS=(PROTOCOL=TCP)(HOST=192.168.0.5)(PORT=1521))
        [main] [ 2016-06-12 02:22:51.341 IST ] [NetworkUtils.getOneLocalListenerProtocolAddress:3402] Returning bestSoFar=(ADDRESS=(PROTOCOL=TCP)(HOST=192.168.0.5)(PORT=1521))
        [main] [ 2016-06-12 02:22:51.341 IST ] [NetworkUtils.getOneLocalListenerProtocolAddress:3402] Returning bestSoFar=(ADDRESS=(PROTOCOL=TCP)(HOST=192.168.0.5)(PORT=1521))
        [main] [ 2016-06-12 02:22:51.341 IST ] [NetworkUtils.isDefaultHostName:2793] lsnrHost: 192.168.0.5 ==> ip address:192.168.0.5 host: Lenovo-PC ==> ip address:192.168.0.5
        [main] [ 2016-06-12 02:22:51.341 IST ] [NetworkUtils.getLocalListenerAddresses:1317] listener[0]=LISTENER address=null
        [main] [ 2016-06-12 02:22:51.341 IST ] [StepContext.setListenersToUpdate:946] needLocalListener = false
        [main] [ 2016-06-12 02:22:51.357 IST ] [InventoryUtil.getOUIInvSession:349] setting OUI READ level to ACCESSLEVEL_READ_LOCKLESS
        [main] [ 2016-06-12 02:22:51.357 IST ] [InventoryUtil.getHomeName:113] homeName = E1Local
        [main] [ 2016-06-12 02:22:51.357 IST ] [OsUtilsBase.getOracleHomeKeyImpl:992] getting home key for home name: E1Local
        [main] [ 2016-06-12 02:22:51.357 IST ] [OsUtilsBase.getRegistryEntry:1026] hklmKey while getting registry entryHKEY_LOCAL_MACHINE
        [main] [ 2016-06-12 02:22:51.357 IST ] [OsUtilsBase.getRegistryEntry:1027] keyToSet while getting registry entrySOFTWARE\ORACLE\KEY_E1Local
        [main] [ 2016-06-12 02:22:51.357 IST ] [OracleHome.hasEELicense:297] home=C:\Oracle\E1Local has EE licensing
        [main] [ 2016-06-12 02:22:51.357 IST ] [OracleHome.isDatabaseOptionOn:1254] Checking Database Option: Spatial
        [main] [ 2016-06-12 02:22:51.357 IST ] [OracleHome.isDatabaseOptionOn:1311] Database Option Spatial is true
        [main] [ 2016-06-12 02:22:51.419 IST ] [OracleHome.isDatabaseOptionOn:1254] Checking Database Option: OLAP
        [main] [ 2016-06-12 02:22:51.419 IST ] [OracleHome.isDatabaseOptionOn:1311] Database Option OLAP is true
        [main] [ 2016-06-12 02:22:51.435 IST ] [InventoryUtil.getOUIInvSession:349] setting OUI READ level to ACCESSLEVEL_READ_LOCKLESS
        [main] [ 2016-06-12 02:22:51.435 IST ] [InventoryUtil.getHomeName:113] homeName = E1Local
        [main] [ 2016-06-12 02:22:51.435 IST ] [OsUtilsBase.getOracleHomeKeyImpl:992] getting home key for home name: E1Local
        [main] [ 2016-06-12 02:22:51.435 IST ] [OsUtilsBase.getRegistryEntry:1026] hklmKey while getting registry entryHKEY_LOCAL_MACHINE
        [main] [ 2016-06-12 02:22:51.435 IST ] [OsUtilsBase.getRegistryEntry:1027] keyToSet while getting registry entrySOFTWARE\ORACLE\KEY_E1Local
        [main] [ 2016-06-12 02:22:51.435 IST ] [OracleHome.hasEELicense:297] home=C:\Oracle\E1Local has EE licensing
        [main] [ 2016-06-12 02:22:51.435 IST ] [InitParamHandler.endElement:547] CustomSGA flag: true
        [main] [ 2016-06-12 02:22:51.435 IST ] [InitParamHandler.endElement:548] Database Type: MULTIPURPOSE
        [main] [ 2016-06-12 02:22:51.435 IST ] [InitParamHandler.endElement:549] Mem Percentage: 40
        [main] [ 2016-06-12 02:22:51.435 IST ] [DatafileCloneHandler.startElement:209] atts name cdb
        [main] [ 2016-06-12 02:22:51.435 IST ] [DatafileCloneHandler.startElement:211] atts lenght false
        [main] [ 2016-06-12 02:22:51.450 IST ] [DatabaseStorageAttributes.addRedoLogGroup:331] This thread doesnot exist in existing thread to group map
        [main] [ 2016-06-12 02:22:51.450 IST ] [DatabaseStorageAttributes.addRedoLogGroup:269] Current threadID=1
        [main] [ 2016-06-12 02:22:51.450 IST ] [DatabaseStorageAttributes.addRedoLogGroup:270] newThread threadID=1
        [main] [ 2016-06-12 02:22:51.450 IST ] [DatabaseStorageAttributes.addRedoLogGroup:303] redoGroups.length 1
        [main] [ 2016-06-12 02:22:51.450 IST ] [DatabaseStorageAttributes.addRedoLogGroup:305] new redoGroup id 2
        [main] [ 2016-06-12 02:22:51.450 IST ] [DatabaseStorageAttributes.addRedoLogGroup:310] redoGroups 1
        [main] [ 2016-06-12 02:22:51.450 IST ] [DatabaseStorageAttributes.addRedoLogGroup:321] arRedoGroups:[1, 2] adding to thread id 1
        [main] [ 2016-06-12 02:22:51.466 IST ] [DatabaseStorageAttributes.addRedoLogGroup:269] Current threadID=1
        [main] [ 2016-06-12 02:22:51.466 IST ] [DatabaseStorageAttributes.addRedoLogGroup:270] newThread threadID=1
        [main] [ 2016-06-12 02:22:51.466 IST ] [DatabaseStorageAttributes.addRedoLogGroup:303] redoGroups.length 2
        [main] [ 2016-06-12 02:22:51.466 IST ] [DatabaseStorageAttributes.addRedoLogGroup:305] new redoGroup id 3
        [main] [ 2016-06-12 02:22:51.466 IST ] [DatabaseStorageAttributes.addRedoLogGroup:310] redoGroups 1
        [main] [ 2016-06-12 02:22:51.466 IST ] [DatabaseStorageAttributes.addRedoLogGroup:310] redoGroups 2
        [main] [ 2016-06-12 02:22:51.466 IST ] [DatabaseStorageAttributes.addRedoLogGroup:321] arRedoGroups:[1, 2, 3] adding to thread id 1
        [main] [ 2016-06-12 02:22:51.466 IST ] [TemplateManager.getParsedAttributes:1710] is Template a CDB false
        [main] [ 2016-06-12 02:22:51.466 IST ] [TemplateManager.getParsedAttributes:1778] Dynamic FRA false
        [main] [ 2016-06-12 02:22:51.466 IST ] [TemplateManager.parseCloneTemplate:1353] See for any transportable datafiles in TemplateManager…..
        [main] [ 2016-06-12 02:22:51.466 IST ] [Host.setupOIDCommandlineParameters:9423] setupOIDCommandlineParameters:
        [main] [ 2016-06-12 02:22:51.466 IST ] [Host.setupOIDCommandlineParameters:9424] m_regWithdirService: false
        [main] [ 2016-06-12 02:22:51.466 IST ] [Host.setupOIDCommandlineParameters:9425] m_unregWithdirService: false
        [main] [ 2016-06-12 02:22:51.466 IST ] [Host.setupOIDCommandlineParameters:9426] m_updateDirService: false
        [main] [ 2016-06-12 02:22:51.466 IST ] [Host.startOperation:2794] setDataBaseType :0
        [main] [ 2016-06-12 02:22:51.466 IST ] [Host.startOperation:2877] is Template CDB false
        [main] [ 2016-06-12 02:22:51.466 IST ] [TemplateManager.isInstallTemplate:2348] Selected Template by user:=E1Local
        [main] [ 2016-06-12 02:22:51.466 IST ] [TemplateManager.isInstallTemplate:2355] The Message Id to be searched:=null
        [main] [ 2016-06-12 02:22:51.466 IST ] [Host.startOperation:2919] Template Selected is NON-CDB Template. Creating database as NON-CDB
        [main] [ 2016-06-12 02:22:51.466 IST ] [HAUtils.getCurrentOracleHome:593] Oracle home from system property: C:\Oracle\E1Local
        [main] [ 2016-06-12 02:22:51.466 IST ] [HAUtils.getConfiguredGridHome:1343] —– Getting CRS HOME —-
        [main] [ 2016-06-12 02:22:51.466 IST ] [WindowsSystem.getCRSHome:1809] olrKey = HKEY_LOCAL_MACHINE\Software\Oracle\Olr
        [main] [ 2016-06-12 02:22:51.466 IST ] [WindowsSystem.regKeyExists:1343] WindowsSystem.regKeyExists: mainkey= HKEY_LOCAL_MACHINE subkey = Software\Oracle\Olr
        [main] [ 2016-06-12 02:22:51.497 IST ] [HAUtils.getHASHome:1500] Failed to get HAS home.
        PRCI-1144 : Failed to retrieve Oracle Grid Infrastructure home path
        PRKN-1036 : Windows registry key “HKEY_LOCAL_MACHINE\Software\Oracle\Olr” not found on node “localnode”
        [main] [ 2016-06-12 02:22:51.497 IST ] [HADatabaseUtils.isGridMgmtDB:2846] Mgmt DBName from srvm _mgmtdb
        [main] [ 2016-06-12 02:22:51.497 IST ] [Verifier.processRawConfigFile:2993] StorageType == 0
        [main] [ 2016-06-12 02:22:51.497 IST ] [SilentHost.performOperation:458] processRawConfigFile=true
        [main] [ 2016-06-12 02:22:51.497 IST ] [Host.initializeValidationContext:1260] sid, uniquenname, domain set in validationcontextE1Local E1LOCAL, E1Local,
        [main] [ 2016-06-12 02:22:51.497 IST ] [Verifier.getStorageDataForValidation:4938] Entering getStorageDataForValidation
        [main] [ 2016-06-12 02:22:51.513 IST ] [HAUtils.getCurrentOracleHome:593] Oracle home from system property: C:\Oracle\E1Local
        [main] [ 2016-06-12 02:22:51.513 IST ] [HAUtils.getConfiguredGridHome:1343] —– Getting CRS HOME —-
        [main] [ 2016-06-12 02:22:51.513 IST ] [WindowsSystem.getCRSHome:1809] olrKey = HKEY_LOCAL_MACHINE\Software\Oracle\Olr
        [main] [ 2016-06-12 02:22:51.513 IST ] [WindowsSystem.regKeyExists:1343] WindowsSystem.regKeyExists: mainkey= HKEY_LOCAL_MACHINE subkey = Software\Oracle\Olr
        [main] [ 2016-06-12 02:22:51.513 IST ] [HAUtils.getHASHome:1500] Failed to get HAS home.
        PRCI-1144 : Failed to retrieve Oracle Grid Infrastructure home path
        PRKN-1036 : Windows registry key “HKEY_LOCAL_MACHINE\Software\Oracle\Olr” not found on node “localnode”
        [main] [ 2016-06-12 02:22:51.513 IST ] [ASMUtils.initialize:247] ASMHome: null
        [main] [ 2016-06-12 02:22:51.528 IST ] [KfodUtil.kfodOutput:361] null\rdbms\bin\kfod.exe
        [main] [ 2016-06-12 02:22:51.528 IST ] [KfodUtil.kfodOutput:361] nohdr=TRUE
        [main] [ 2016-06-12 02:22:51.528 IST ] [KfodUtil.kfodOutput:361] OP=GROUPS
        [main] [ 2016-06-12 02:22:51.528 IST ] [KfodUtil.kfodOutput:361] status=true
        [main] [ 2016-06-12 02:22:51.528 IST ] [KfodUtil.kfodOutput:361] asmcompatibility=true dbcompatibility=true
        [main] [ 2016-06-12 02:22:51.544 IST ] [KfodUtil.kfodOutput:368] Cannot run program “null\rdbms\bin\kfod.exe”: CreateProcess error=2, The system cannot find the file specified
        [main] [ 2016-06-12 02:22:51.544 IST ] [KfodUtil.kfodOutput:369] Cannot run program “null\rdbms\bin\kfod.exe”: CreateProcess error=2, The system cannot find the file specified
        java.lang.ProcessBuilder.processException(ProcessBuilder.java:478)
        java.lang.ProcessBuilder.start(ProcessBuilder.java:457)
        java.lang.Runtime.exec(Runtime.java:593)
        java.lang.Runtime.exec(Runtime.java:466)
        oracle.sysman.assistants.util.OsUtilsBase.execProg(OsUtilsBase.java:2300)
        oracle.sysman.assistants.util.OsUtilsBase.execProgNReturnOutput(OsUtilsBase.java:2448)
        oracle.sysman.assistants.util.KfodUtil.kfodOutput(KfodUtil.java:364)
        oracle.sysman.assistants.util.KfodUtil.kfodOutput(KfodUtil.java:254)
        oracle.sysman.assistants.util.KfodUtil.getDiskgroupsWithCompatibilityValues(KfodUtil.java:569)
        oracle.sysman.assistants.util.asm.ASMUtils.loadDiskGroups(ASMUtils.java:1040)
        oracle.sysman.assistants.util.asm.ASMUtils.initialize(ASMUtils.java:277)
        oracle.sysman.assistants.util.asm.ASMUtils.getASMUtils(ASMUtils.java:192)
        oracle.sysman.assistants.dbca.backend.Verifier.initASMDGSpace(Verifier.java:3574)
        oracle.sysman.assistants.dbca.backend.Verifier.initialiseStorageValidationData(Verifier.java:3562)
        oracle.sysman.assistants.dbca.backend.Verifier.getStorageDataForValidation(Verifier.java:4939)
        oracle.sysman.assistants.dbca.backend.Host.initializeValidationContext(Host.java:1407)
        oracle.sysman.assistants.dbca.backend.SilentHost.performOperation(SilentHost.java:460)
        oracle.sysman.assistants.dbca.backend.Host.startOperation(Host.java:3809)
        oracle.sysman.assistants.dbca.Dbca.execute(Dbca.java:153)
        oracle.sysman.assistants.dbca.Dbca.main(Dbca.java:226)
        java.lang.ProcessBuilder.processException(ProcessBuilder.java:478)
        java.lang.ProcessBuilder.start(ProcessBuilder.java:457)
        java.lang.Runtime.exec(Runtime.java:593)
        java.lang.Runtime.exec(Runtime.java:466)
        oracle.sysman.assistants.util.OsUtilsBase.execProg(OsUtilsBase.java:2300)
        oracle.sysman.assistants.util.OsUtilsBase.execProgNReturnOutput(OsUtilsBase.java:2448)
        oracle.sysman.assistants.util.KfodUtil.kfodOutput(KfodUtil.java:364)
        oracle.sysman.assistants.util.KfodUtil.kfodOutput(KfodUtil.java:254)
        oracle.sysman.assistants.util.KfodUtil.getDiskgroupsWithCompatibilityValues(KfodUtil.java:569)
        oracle.sysman.assistants.util.asm.ASMUtils.loadDiskGroups(ASMUtils.java:1040)
        oracle.sysman.assistants.util.asm.ASMUtils.initialize(ASMUtils.java:277)
        oracle.sysman.assistants.util.asm.ASMUtils.getASMUtils(ASMUtils.java:192)
        oracle.sysman.assistants.dbca.backend.Verifier.initASMDGSpace(Verifier.java:3574)
        oracle.sysman.assistants.dbca.backend.Verifier.initialiseStorageValidationData(Verifier.java:3562)
        oracle.sysman.assistants.dbca.backend.Verifier.getStorageDataForValidation(Verifier.java:4939)
        oracle.sysman.assistants.dbca.backend.Host.initializeValidationContext(Host.java:1407)
        oracle.sysman.assistants.dbca.backend.SilentHost.performOperation(SilentHost.java:460)
        oracle.sysman.assistants.dbca.backend.Host.startOperation(Host.java:3809)
        oracle.sysman.assistants.dbca.Dbca.execute(Dbca.java:153)
        oracle.sysman.assistants.dbca.Dbca.main(Dbca.java:226)
        [main] [ 2016-06-12 02:22:51.544 IST ] [KfodUtil.kfodOutput:372] Kfod result null
        [main] [ 2016-06-12 02:22:51.544 IST ] [Verifier.initASMDGSpace:3580] omfLocation=null
        [main] [ 2016-06-12 02:22:51.544 IST ] [Verifier.initASMDGSpace:3593] ControlFile Name {ORACLE_BASE}\oradata\{DB_UNIQUE_NAME}\
        [main] [ 2016-06-12 02:22:51.544 IST ] [Verifier.initASMDGSpace:3593] ControlFile Name {ORACLE_BASE}\fast_recovery_area\{DB_UNIQUE_NAME}\
        [main] [ 2016-06-12 02:22:51.544 IST ] [Verifier.initASMDGSpace:3614] datafile name {ORACLE_BASE}\oradata\{DB_UNIQUE_NAME}\
        [main] [ 2016-06-12 02:22:51.575 IST ] [Verifier.initASMDGSpace:3614] datafile name {ORACLE_BASE}\oradata\{DB_UNIQUE_NAME}\
        [main] [ 2016-06-12 02:22:51.575 IST ] [Verifier.initASMDGSpace:3614] datafile name {ORACLE_BASE}\oradata\{DB_UNIQUE_NAME}\
        [main] [ 2016-06-12 02:22:51.575 IST ] [Verifier.initASMDGSpace:3614] datafile name {ORACLE_BASE}\oradata\{DB_UNIQUE_NAME}\
        [main] [ 2016-06-12 02:22:51.575 IST ] [Verifier.initASMDGSpace:3624] Adding an extra 80 space for undo tbs
        [main] [ 2016-06-12 02:22:51.575 IST ] [Verifier.initASMDGSpace:3783] Skipping this redolog as its not on ASM
        [main] [ 2016-06-12 02:22:51.575 IST ] [Verifier.initASMDGSpace:3783] Skipping this redolog as its not on ASM
        [main] [ 2016-06-12 02:22:51.575 IST ] [Verifier.initASMDGSpace:3783] Skipping this redolog as its not on ASM
        [main] [ 2016-06-12 02:22:51.575 IST ] [HADatabaseUtils.isGridMgmtDB:2846] Mgmt DBName from srvm _mgmtdb
        [main] [ 2016-06-12 02:22:51.575 IST ] [Verifier.initASMDGSpace:3825] Skipping passwowd file compatible check for MGMTDB/sidb
        [main] [ 2016-06-12 02:22:51.575 IST ] [Verifier.initASMDGSpace:3940] Exiting getStorageDataForValidation
        [main] [ 2016-06-12 02:22:51.575 IST ] [Verifier.initFSSpace:4423] omfLocation=null
        [main] [ 2016-06-12 02:22:51.575 IST ] [Verifier.initFSSpace:4444] Entering newCalculateCloneDatafilePathsAndSizes
        [main] [ 2016-06-12 02:22:51.575 IST ] [CommonAttributes.replaceVariables:1402] var2 C:\Oracle
        [main] [ 2016-06-12 02:22:51.575 IST ] [CommonAttributes.replaceVariables:1402] var2 E1Local
        [main] [ 2016-06-12 02:22:51.575 IST ] [Verifier.initFSSpace:4485] clone C:\Oracle\oradata\E1Local\SYSAUX01.DBF 1024000
        [main] [ 2016-06-12 02:22:51.575 IST ] [Verifier.updateSizeMap:4908] canonicalPath=C:\Oracle\oradata\E1Local\SYSAUX01.DBF\
        [main] [ 2016-06-12 02:22:51.575 IST ] [Verifier.updateSizeMap:4921] Adding required size for C:\Oracle\oradata\E1Local\SYSAUX01.DBF\ to 1000
        [main] [ 2016-06-12 02:22:51.575 IST ] [CommonAttributes.replaceVariables:1402] var2 C:\Oracle
        [main] [ 2016-06-12 02:22:51.591 IST ] [CommonAttributes.replaceVariables:1402] var2 E1Local
        [main] [ 2016-06-12 02:22:51.591 IST ] [Verifier.initFSSpace:4485] clone C:\Oracle\oradata\E1Local\SYSTEM01.DBF 1024000
        [main] [ 2016-06-12 02:22:51.591 IST ] [Verifier.updateSizeMap:4908] canonicalPath=C:\Oracle\oradata\E1Local\SYSTEM01.DBF\
        [main] [ 2016-06-12 02:22:51.591 IST ] [Verifier.updateSizeMap:4921] Adding required size for C:\Oracle\oradata\E1Local\SYSTEM01.DBF\ to 1000
        [main] [ 2016-06-12 02:22:51.591 IST ] [CommonAttributes.replaceVariables:1402] var2 C:\Oracle
        [main] [ 2016-06-12 02:22:51.591 IST ] [CommonAttributes.replaceVariables:1402] var2 E1Local
        [main] [ 2016-06-12 02:22:51.591 IST ] [Verifier.initFSSpace:4485] clone C:\Oracle\oradata\E1Local\UNDOTBS01.DBF 512000
        [main] [ 2016-06-12 02:22:51.606 IST ] [Verifier.updateSizeMap:4908] canonicalPath=C:\Oracle\oradata\E1Local\UNDOTBS01.DBF\
        [main] [ 2016-06-12 02:22:51.606 IST ] [Verifier.updateSizeMap:4921] Adding required size for C:\Oracle\oradata\E1Local\UNDOTBS01.DBF\ to 500
        [main] [ 2016-06-12 02:22:51.606 IST ] [CommonAttributes.replaceVariables:1402] var2 C:\Oracle
        [main] [ 2016-06-12 02:22:51.606 IST ] [CommonAttributes.replaceVariables:1402] var2 E1Local
        [main] [ 2016-06-12 02:22:51.606 IST ] [Verifier.initFSSpace:4485] clone C:\Oracle\oradata\E1Local\USERS01.DBF 5120
        [main] [ 2016-06-12 02:22:51.606 IST ] [Verifier.updateSizeMap:4908] canonicalPath=C:\Oracle\oradata\E1Local\USERS01.DBF\
        [main] [ 2016-06-12 02:22:51.606 IST ] [Verifier.updateSizeMap:4921] Adding required size for C:\Oracle\oradata\E1Local\USERS01.DBF\ to 5
        [main] [ 2016-06-12 02:22:51.606 IST ] [CommonAttributes.replaceVariables:1402] var2 C:\Oracle
        [main] [ 2016-06-12 02:22:51.606 IST ] [CommonAttributes.replaceVariables:1402] var2 E1Local
        [main] [ 2016-06-12 02:22:51.606 IST ] [Verifier.initFSSpace:4485] clone C:\Oracle\oradata\E1Local\TEMP01.DBF 256000
        [main] [ 2016-06-12 02:22:51.606 IST ] [Verifier.updateSizeMap:4908] canonicalPath=C:\Oracle\oradata\E1Local\TEMP01.DBF\
        [main] [ 2016-06-12 02:22:51.606 IST ] [Verifier.updateSizeMap:4921] Adding required size for C:\Oracle\oradata\E1Local\TEMP01.DBF\ to 250
        [main] [ 2016-06-12 02:22:51.606 IST ] [CommonAttributes.replaceVariables:1402] var2 C:\Oracle
        [main] [ 2016-06-12 02:22:51.606 IST ] [CommonAttributes.replaceVariables:1402] var2 E1Local
        [main] [ 2016-06-12 02:22:51.606 IST ] [Verifier.initFSSpace:4491] Adding an extra 80 space for undo tbs
        [main] [ 2016-06-12 02:22:51.606 IST ] [Verifier.updateSizeMap:4908] canonicalPath=C:\Oracle\oradata\E1Local\
        [main] [ 2016-06-12 02:22:51.606 IST ] [Verifier.updateSizeMap:4921] Adding required size for C:\Oracle\oradata\E1Local\ to 0
        [main] [ 2016-06-12 02:22:51.606 IST ] [CommonAttributes.replaceVariables:1402] var2 C:\Oracle
        [main] [ 2016-06-12 02:22:51.606 IST ] [CommonAttributes.replaceVariables:1402] var2 E1Local
        [main] [ 2016-06-12 02:22:51.606 IST ] [Verifier.initFSSpace:4662] redo C:\Oracle\oradata\E1Local\ 256000
        [main] [ 2016-06-12 02:22:51.606 IST ] [Verifier.updateSizeMap:4908] canonicalPath=C:\Oracle\oradata\E1Local\
        [main] [ 2016-06-12 02:22:51.606 IST ] [Verifier.updateSizeMap:4914] Updating required size for C:\Oracle\oradata\E1Local\ to 250
        [main] [ 2016-06-12 02:22:51.606 IST ] [CommonAttributes.replaceVariables:1402] var2 C:\Oracle
        [main] [ 2016-06-12 02:22:51.606 IST ] [CommonAttributes.replaceVariables:1402] var2 E1Local
        [main] [ 2016-06-12 02:22:51.606 IST ] [Verifier.initFSSpace:4662] redo C:\Oracle\oradata\E1Local\ 256000
        [main] [ 2016-06-12 02:22:51.606 IST ] [Verifier.updateSizeMap:4908] canonicalPath=C:\Oracle\oradata\E1Local\
        [main] [ 2016-06-12 02:22:51.606 IST ] [Verifier.updateSizeMap:4914] Updating required size for C:\Oracle\oradata\E1Local\ to 500
        [main] [ 2016-06-12 02:22:51.622 IST ] [CommonAttributes.replaceVariables:1402] var2 C:\Oracle
        [main] [ 2016-06-12 02:22:51.622 IST ] [CommonAttributes.replaceVariables:1402] var2 E1Local
        [main] [ 2016-06-12 02:22:51.622 IST ] [Verifier.initFSSpace:4662] redo C:\Oracle\oradata\E1Local\ 256000
        [main] [ 2016-06-12 02:22:51.622 IST ] [Verifier.updateSizeMap:4908] canonicalPath=C:\Oracle\oradata\E1Local\
        [main] [ 2016-06-12 02:22:51.622 IST ] [Verifier.updateSizeMap:4914] Updating required size for C:\Oracle\oradata\E1Local\ to 750
        [main] [ 2016-06-12 02:22:51.622 IST ] [CommonAttributes.replaceVariables:1402] var2 C:\Oracle
        [main] [ 2016-06-12 02:22:51.622 IST ] [CommonAttributes.replaceVariables:1402] var2 E1Local
        [main] [ 2016-06-12 02:22:51.622 IST ] [Verifier.initFSSpace:4694] contrl and buffer C:\Oracle\oradata\E1Local\ 120
        [main] [ 2016-06-12 02:22:51.622 IST ] [Verifier.updateSizeMap:4908] canonicalPath=C:\Oracle\oradata\E1Local\
        [main] [ 2016-06-12 02:22:51.622 IST ] [Verifier.updateSizeMap:4914] Updating required size for C:\Oracle\oradata\E1Local\ to 750
        [main] [ 2016-06-12 02:22:51.622 IST ] [CommonAttributes.replaceVariables:1402] var2 C:\Oracle
        [main] [ 2016-06-12 02:22:51.622 IST ] [CommonAttributes.replaceVariables:1402] var2 E1Local
        [main] [ 2016-06-12 02:22:51.622 IST ] [Verifier.initFSSpace:4694] contrl and buffer C:\Oracle\fast_recovery_area\E1Local\ 120
        [main] [ 2016-06-12 02:22:51.622 IST ] [Verifier.updateSizeMap:4908] canonicalPath=C:\Oracle\fast_recovery_area\E1Local\
        [main] [ 2016-06-12 02:22:51.622 IST ] [Verifier.updateSizeMap:4921] Adding required size for C:\Oracle\fast_recovery_area\E1Local\ to 0
        [main] [ 2016-06-12 02:22:51.622 IST ] [Verifier.initFSSpace:4862] Adding File path: C:\ORACLE\ORADATA\E1LOCAL\SYSAUX01.DBF for file existence check
        [main] [ 2016-06-12 02:22:51.622 IST ] [Verifier.initFSSpace:4862] Adding File path: C:\ORACLE\ORADATA\E1LOCAL\SYSTEM01.DBF for file existence check
        [main] [ 2016-06-12 02:22:51.622 IST ] [Verifier.initFSSpace:4862] Adding File path: C:\ORACLE\ORADATA\E1LOCAL\UNDOTBS01.DBF for file existence check
        [main] [ 2016-06-12 02:22:51.622 IST ] [Verifier.initFSSpace:4862] Adding File path: C:\ORACLE\ORADATA\E1LOCAL\USERS01.DBF for file existence check
        [main] [ 2016-06-12 02:22:51.622 IST ] [Verifier.initFSSpace:4862] Adding File path: C:\ORACLE\ORADATA\E1LOCAL\TEMP01.DBF for file existence check
        [main] [ 2016-06-12 02:22:51.622 IST ] [Verifier.initFSSpace:4865] Exiting getStorageDataForValidation
        [main] [ 2016-06-12 02:22:51.622 IST ] [OsUtilsBase.getBaseFromOrabase:659] oraBaseUtility C:\Oracle\E1Local\bin\orabase.exe
        [main] [ 2016-06-12 02:22:51.622 IST ] [OsUtilsBase.getBaseFromOrabase:668] cmds: C:\Oracle\E1Local\bin\orabase.exe
        [main] [ 2016-06-12 02:22:51.622 IST ] [OsUtilsBase.getBaseFromOrabase:672] envs: ORACLE_HOME=C:\Oracle\E1Local
        [main] [ 2016-06-12 02:22:51.778 IST ] [OsUtilsBase.getBaseFromOrabase:682] baseLocation from orabase
        C:\Oracle
        [main] [ 2016-06-12 02:22:51.778 IST ] [OsUtilsBase.getBaseFromOrabase:707] orabaseLocation= C:\Oracle
        [main] [ 2016-06-12 02:22:51.778 IST ] [SilentHost.performOperation:461] after initialize validation context for silent mode
        [main] [ 2016-06-12 02:22:51.794 IST ] [OsUtilsBase.is64Bit:395] architecture is 64 bit: true
        [main] [ 2016-06-12 02:22:51.794 IST ] [MemoryCalculator.:103] setting memory minimums for 64 bit
        [main] [ 2016-06-12 02:22:52.012 IST ] [ClusterVerification.getInstance:399] Method Entry
        [main] [ 2016-06-12 02:22:52.028 IST ] [ParamManager.:668] m_paramInstantiated set to TRUE
        [main] [ 2016-06-12 02:22:52.028 IST ] [VerificationUtil.getLocalHost:1321] Hostname retrieved: Lenovo-PC, returned: Lenovo-PC
        [main] [ 2016-06-12 02:22:52.043 IST ] [cluster.Version.isPre:-1] version to be checked 12.1.0.2.0 major version to check against 10
        [main] [ 2016-06-12 02:22:52.043 IST ] [cluster.Version.isPre:-1] isPre.java: Returning FALSE
        [main] [ 2016-06-12 02:22:52.043 IST ] [cluster.Version.isPre:-1] version to be checked 12.1.0.2.0 major version to check against 10
        [main] [ 2016-06-12 02:22:52.043 IST ] [cluster.Version.isPre:-1] isPre.java: Returning FALSE
        [main] [ 2016-06-12 02:22:52.043 IST ] [WindowsSystem.regKeyExists:1343] WindowsSystem.regKeyExists: mainkey= HKEY_LOCAL_MACHINE subkey = Software\Oracle\Ocr
        [main] [ 2016-06-12 02:22:52.137 IST ] [WindowsSystem.isCRSConfigured:1741] isOCRConfigured=false
        [main] [ 2016-06-12 02:22:52.137 IST ] [VerificationUtil.isCRSConfigured:4218] crsConfigured=false
        [main] [ 2016-06-12 02:22:52.137 IST ] [cluster.Version.isPre:-1] version to be checked 12.1.0.2.0 major version to check against 10
        [main] [ 2016-06-12 02:22:52.137 IST ] [cluster.Version.isPre:-1] isPre.java: Returning FALSE
        [main] [ 2016-06-12 02:22:52.137 IST ] [cluster.Version.isPre:-1] version to be checked 12.1.0.2.0 major version to check against 10
        [main] [ 2016-06-12 02:22:52.137 IST ] [cluster.Version.isPre:-1] isPre.java: Returning FALSE
        [main] [ 2016-06-12 02:22:52.137 IST ] [WindowsSystem.regKeyExists:1343] WindowsSystem.regKeyExists: mainkey= HKEY_LOCAL_MACHINE subkey = Software\Oracle\Ocr
        [main] [ 2016-06-12 02:22:52.137 IST ] [WindowsSystem.isCRSConfigured:1741] isOCRConfigured=false
        [main] [ 2016-06-12 02:22:52.137 IST ] [cluster.Version.isPre:-1] version to be checked 12.1.0.2.0 major version to check against 11
        [main] [ 2016-06-12 02:22:52.137 IST ] [cluster.Version.isPre:-1] isPre.java: Returning FALSE
        [main] [ 2016-06-12 02:22:52.137 IST ] [cluster.Version.isPre:-1] version to be checked 12.1.0.2.0 major version to check against 11 minor version to check against 2
        [main] [ 2016-06-12 02:22:52.137 IST ] [cluster.Version.isPre:-1] isPre: Returning FALSE for major version check
        [main] [ 2016-06-12 02:22:52.137 IST ] [WindowsSystem.isHAConfigured:1765] olrKey = HKEY_LOCAL_MACHINE\Software\Oracle\Olr
        [main] [ 2016-06-12 02:22:52.137 IST ] [WindowsSystem.regKeyExists:1343] WindowsSystem.regKeyExists: mainkey= HKEY_LOCAL_MACHINE subkey = Software\Oracle\Olr
        [main] [ 2016-06-12 02:22:52.137 IST ] [WindowsSystem.isHAConfigured:1792] isOLRConfigured=false
        [main] [ 2016-06-12 02:22:52.137 IST ] [VerificationUtil.isHAConfigured:4190] haConfigured=false
        [main] [ 2016-06-12 02:22:52.215 IST ] [Verifier.validateMemory:1221] Verification Exception: The default location for framework home is not available. It must be specified
        [main] [ 2016-06-12 02:22:52.215 IST ] [Verifier.validateSharedPoolSize:1275] checkUnified false
        [main] [ 2016-06-12 02:22:52.215 IST ] [Verifier.validateSharedPoolSize:1276] checkUnified -1
        [main] [ 2016-06-12 02:22:52.215 IST ] [Verifier.validateSharedPoolSize:1316] process count : 500
        [main] [ 2016-06-12 02:22:52.215 IST ] [HAUtils.getCurrentOracleHome:593] Oracle home from system property: C:\Oracle\E1Local
        [main] [ 2016-06-12 02:22:52.215 IST ] [HAUtils.getConfiguredGridHome:1343] —– Getting CRS HOME —-
        [main] [ 2016-06-12 02:22:52.215 IST ] [WindowsSystem.getCRSHome:1809] olrKey = HKEY_LOCAL_MACHINE\Software\Oracle\Olr
        [main] [ 2016-06-12 02:22:52.215 IST ] [WindowsSystem.regKeyExists:1343] WindowsSystem.regKeyExists: mainkey= HKEY_LOCAL_MACHINE subkey = Software\Oracle\Olr
        [main] [ 2016-06-12 02:22:52.215 IST ] [HAUtils.getHASHome:1500] Failed to get HAS home.
        PRCI-1144 : Failed to retrieve Oracle Grid Infrastructure home path
        PRKN-1036 : Windows registry key “HKEY_LOCAL_MACHINE\Software\Oracle\Olr” not found on node “localnode”
        [main] [ 2016-06-12 02:22:52.215 IST ] [Host.validate:5350] calling validatebackend
        [main] [ 2016-06-12 02:22:52.215 IST ] [Verifier.validateBackend:1028] starting validateBackend
        [main] [ 2016-06-12 02:22:52.246 IST ] [DBCAValidator.loadCreateDBValidationGroups:400] run si db validations
        [main] [ 2016-06-12 02:22:52.246 IST ] [Host.noEntryinOratab:7199] Check made for oratab arg passed…………
        [main] [ 2016-06-12 02:22:52.246 IST ] [DBCAValidator.loadCreateDBValidationGroups:403] skip dbid validatoin for SI
        [main] [ 2016-06-12 02:22:52.246 IST ] [DBCAValidator.loadCreateDBValidationGroups:415] isCluster false
        [main] [ 2016-06-12 02:22:52.246 IST ] [DBCAValidator.loadCreateDBValidationGroups:416] isHARegnReq false
        [main] [ 2016-06-12 02:22:52.262 IST ] [DBIdentificationHelper.getDbNameError:224] gdbname isE1Local
        [main] [ 2016-06-12 02:22:52.308 IST ] [Verifier.validateBackend:1035] Validation Result:
        Unique database identifier check passed.
        [main] [ 2016-06-12 02:22:52.308 IST ] [Verifier.validateBackend:1060] write result to trace true
        [main] [ 2016-06-12 02:22:52.308 IST ] [StorageSpaceCheck.validate:97] Getting volumes from space maps 7, 0
        [main] [ 2016-06-12 02:22:52.308 IST ] [StorageSpaceCheck.getConsolidatedMap:312] locationString processed: C:\Oracle\fast_recovery_area\E1Local original String: C:\Oracle\fast_recovery_area\E1Local\
        [main] [ 2016-06-12 02:22:52.308 IST ] [HAUtils.getCurrentOracleHome:593] Oracle home from system property: C:\Oracle\E1Local
        [main] [ 2016-06-12 02:22:52.308 IST ] [HAUtils.getConfiguredGridHome:1343] —– Getting CRS HOME —-
        [main] [ 2016-06-12 02:22:52.308 IST ] [WindowsSystem.getCRSHome:1809] olrKey = HKEY_LOCAL_MACHINE\Software\Oracle\Olr
        [main] [ 2016-06-12 02:22:52.308 IST ] [WindowsSystem.regKeyExists:1343] WindowsSystem.regKeyExists: mainkey= HKEY_LOCAL_MACHINE subkey = Software\Oracle\Olr
        [main] [ 2016-06-12 02:22:52.340 IST ] [HAUtils.getHASHome:1500] Failed to get HAS home.
        PRCI-1144 : Failed to retrieve Oracle Grid Infrastructure home path
        PRKN-1036 : Windows registry key “HKEY_LOCAL_MACHINE\Software\Oracle\Olr” not found on node “localnode”
        [main] [ 2016-06-12 02:22:52.340 IST ] [HAUtils.isPathOnACFS:3995] isPathOnACFS: false
        [main] [ 2016-06-12 02:22:52.527 IST ] [OsUtilsBase.getMountPoint:2822] mount point to be verified H:\
        [main] [ 2016-06-12 02:22:52.527 IST ] [OsUtilsBase.getMountPoint:2822] mount point to be verified G:\
        [main] [ 2016-06-12 02:22:52.527 IST ] [OsUtilsBase.getMountPoint:2822] mount point to be verified F:\
        [main] [ 2016-06-12 02:22:52.527 IST ] [OsUtilsBase.getMountPoint:2822] mount point to be verified E:\
        [main] [ 2016-06-12 02:22:52.542 IST ] [OsUtilsBase.getMountPoint:2822] mount point to be verified D:\
        [main] [ 2016-06-12 02:22:52.542 IST ] [OsUtilsBase.getMountPoint:2822] mount point to be verified C:\
        [main] [ 2016-06-12 02:22:52.542 IST ] [StorageSpaceCheck.getConsolidatedMap:341] Mount point of C:\Oracle\fast_recovery_area\E1Local\ is C:\
        [main] [ 2016-06-12 02:22:52.542 IST ] [StorageSpaceCheck.getConsolidatedMap:312] locationString processed: C:\Oracle\oradata\E1Local\SYSTEM01.DBF original String: C:\Oracle\oradata\E1Local\SYSTEM01.DBF\
        [main] [ 2016-06-12 02:22:52.542 IST ] [HAUtils.getCurrentOracleHome:593] Oracle home from system property: C:\Oracle\E1Local
        [main] [ 2016-06-12 02:22:52.542 IST ] [HAUtils.getConfiguredGridHome:1343] —– Getting CRS HOME —-
        [main] [ 2016-06-12 02:22:52.542 IST ] [WindowsSystem.getCRSHome:1809] olrKey = HKEY_LOCAL_MACHINE\Software\Oracle\Olr
        [main] [ 2016-06-12 02:22:52.542 IST ] [WindowsSystem.regKeyExists:1343] WindowsSystem.regKeyExists: mainkey= HKEY_LOCAL_MACHINE subkey = Software\Oracle\Olr
        [main] [ 2016-06-12 02:22:52.542 IST ] [HAUtils.getHASHome:1500] Failed to get HAS home.
        PRCI-1144 : Failed to retrieve Oracle Grid Infrastructure home path
        PRKN-1036 : Windows registry key “HKEY_LOCAL_MACHINE\Software\Oracle\Olr” not found on node “localnode”
        [main] [ 2016-06-12 02:22:52.542 IST ] [HAUtils.isPathOnACFS:3995] isPathOnACFS: false
        [main] [ 2016-06-12 02:22:52.542 IST ] [OsUtilsBase.getMountPoint:2822] mount point to be verified H:\
        [main] [ 2016-06-12 02:22:52.542 IST ] [OsUtilsBase.getMountPoint:2822] mount point to be verified G:\
        [main] [ 2016-06-12 02:22:52.542 IST ] [OsUtilsBase.getMountPoint:2822] mount point to be verified F:\
        [main] [ 2016-06-12 02:22:52.542 IST ] [OsUtilsBase.getMountPoint:2822] mount point to be verified E:\
        [main] [ 2016-06-12 02:22:52.542 IST ] [OsUtilsBase.getMountPoint:2822] mount point to be verified D:\
        [main] [ 2016-06-12 02:22:52.542 IST ] [OsUtilsBase.getMountPoint:2822] mount point to be verified C:\
        [main] [ 2016-06-12 02:22:52.542 IST ] [StorageSpaceCheck.getConsolidatedMap:341] Mount point of C:\Oracle\oradata\E1Local\SYSTEM01.DBF\ is C:\
        [main] [ 2016-06-12 02:22:52.542 IST ] [StorageSpaceCheck.getConsolidatedMap:312] locationString processed: C:\Oracle\oradata\E1Local\USERS01.DBF original String: C:\Oracle\oradata\E1Local\USERS01.DBF\
        [main] [ 2016-06-12 02:22:52.542 IST ] [HAUtils.getCurrentOracleHome:593] Oracle home from system property: C:\Oracle\E1Local
        [main] [ 2016-06-12 02:22:52.542 IST ] [HAUtils.getConfiguredGridHome:1343] —– Getting CRS HOME —-
        [main] [ 2016-06-12 02:22:52.542 IST ] [WindowsSystem.getCRSHome:1809] olrKey = HKEY_LOCAL_MACHINE\Software\Oracle\Olr
        [main] [ 2016-06-12 02:22:52.542 IST ] [WindowsSystem.regKeyExists:1343] WindowsSystem.regKeyExists: mainkey= HKEY_LOCAL_MACHINE subkey = Software\Oracle\Olr
        [main] [ 2016-06-12 02:22:52.542 IST ] [HAUtils.getHASHome:1500] Failed to get HAS home.
        PRCI-1144 : Failed to retrieve Oracle Grid Infrastructure home path
        PRKN-1036 : Windows registry key “HKEY_LOCAL_MACHINE\Software\Oracle\Olr” not found on node “localnode”
        [main] [ 2016-06-12 02:22:52.542 IST ] [HAUtils.isPathOnACFS:3995] isPathOnACFS: false
        [main] [ 2016-06-12 02:22:52.558 IST ] [OsUtilsBase.getMountPoint:2822] mount point to be verified H:\
        [main] [ 2016-06-12 02:22:52.558 IST ] [OsUtilsBase.getMountPoint:2822] mount point to be verified G:\
        [main] [ 2016-06-12 02:22:52.558 IST ] [OsUtilsBase.getMountPoint:2822] mount point to be verified F:\
        [main] [ 2016-06-12 02:22:52.558 IST ] [OsUtilsBase.getMountPoint:2822] mount point to be verified E:\
        [main] [ 2016-06-12 02:22:52.558 IST ] [OsUtilsBase.getMountPoint:2822] mount point to be verified D:\
        [main] [ 2016-06-12 02:22:52.558 IST ] [OsUtilsBase.getMountPoint:2822] mount point to be verified C:\
        [main] [ 2016-06-12 02:22:52.558 IST ] [StorageSpaceCheck.getConsolidatedMap:341] Mount point of C:\Oracle\oradata\E1Local\USERS01.DBF\ is C:\
        [main] [ 2016-06-12 02:22:52.558 IST ] [StorageSpaceCheck.getConsolidatedMap:312] locationString processed: C:\Oracle\oradata\E1Local\TEMP01.DBF original String: C:\Oracle\oradata\E1Local\TEMP01.DBF\
        [main] [ 2016-06-12 02:22:52.558 IST ] [HAUtils.getCurrentOracleHome:593] Oracle home from system property: C:\Oracle\E1Local
        [main] [ 2016-06-12 02:22:52.558 IST ] [HAUtils.getConfiguredGridHome:1343] —– Getting CRS HOME —-
        [main] [ 2016-06-12 02:22:52.558 IST ] [WindowsSystem.getCRSHome:1809] olrKey = HKEY_LOCAL_MACHINE\Software\Oracle\Olr
        [main] [ 2016-06-12 02:22:52.558 IST ] [WindowsSystem.regKeyExists:1343] WindowsSystem.regKeyExists: mainkey= HKEY_LOCAL_MACHINE subkey = Software\Oracle\Olr
        [main] [ 2016-06-12 02:22:52.558 IST ] [HAUtils.getHASHome:1500] Failed to get HAS home.
        PRCI-1144 : Failed to retrieve Oracle Grid Infrastructure home path
        PRKN-1036 : Windows registry key “HKEY_LOCAL_MACHINE\Software\Oracle\Olr” not found on node “localnode”
        [main] [ 2016-06-12 02:22:52.558 IST ] [HAUtils.isPathOnACFS:3995] isPathOnACFS: false
        [main] [ 2016-06-12 02:22:52.558 IST ] [OsUtilsBase.getMountPoint:2822] mount point to be verified H:\
        [main] [ 2016-06-12 02:22:52.558 IST ] [OsUtilsBase.getMountPoint:2822] mount point to be verified G:\
        [main] [ 2016-06-12 02:22:52.558 IST ] [OsUtilsBase.getMountPoint:2822] mount point to be verified F:\
        [main] [ 2016-06-12 02:22:52.558 IST ] [OsUtilsBase.getMountPoint:2822] mount point to be verified E:\
        [main] [ 2016-06-12 02:22:52.558 IST ] [OsUtilsBase.getMountPoint:2822] mount point to be verified D:\
        [main] [ 2016-06-12 02:22:52.558 IST ] [OsUtilsBase.getMountPoint:2822] mount point to be verified C:\
        [main] [ 2016-06-12 02:22:52.558 IST ] [StorageSpaceCheck.getConsolidatedMap:341] Mount point of C:\Oracle\oradata\E1Local\TEMP01.DBF\ is C:\
        [main] [ 2016-06-12 02:22:52.558 IST ] [StorageSpaceCheck.getConsolidatedMap:312] locationString processed: C:\Oracle\oradata\E1Local\SYSAUX01.DBF original String: C:\Oracle\oradata\E1Local\SYSAUX01.DBF\
        [main] [ 2016-06-12 02:22:52.558 IST ] [HAUtils.getCurrentOracleHome:593] Oracle home from system property: C:\Oracle\E1Local
        [main] [ 2016-06-12 02:22:52.558 IST ] [HAUtils.getConfiguredGridHome:1343] —– Getting CRS HOME —-
        [main] [ 2016-06-12 02:22:52.558 IST ] [WindowsSystem.getCRSHome:1809] olrKey = HKEY_LOCAL_MACHINE\Software\Oracle\Olr
        [main] [ 2016-06-12 02:22:52.558 IST ] [WindowsSystem.regKeyExists:1343] WindowsSystem.regKeyExists: mainkey= HKEY_LOCAL_MACHINE subkey = Software\Oracle\Olr
        [main] [ 2016-06-12 02:22:52.558 IST ] [HAUtils.getHASHome:1500] Failed to get HAS home.
        PRCI-1144 : Failed to retrieve Oracle Grid Infrastructure home path
        PRKN-1036 : Windows registry key “HKEY_LOCAL_MACHINE\Software\Oracle\Olr” not found on node “localnode”
        [main] [ 2016-06-12 02:22:52.558 IST ] [HAUtils.isPathOnACFS:3995] isPathOnACFS: false
        [main] [ 2016-06-12 02:22:52.574 IST ] [OsUtilsBase.getMountPoint:2822] mount point to be verified H:\
        [main] [ 2016-06-12 02:22:52.574 IST ] [OsUtilsBase.getMountPoint:2822] mount point to be verified G:\
        [main] [ 2016-06-12 02:22:52.574 IST ] [OsUtilsBase.getMountPoint:2822] mount point to be verified F:\
        [main] [ 2016-06-12 02:22:52.574 IST ] [OsUtilsBase.getMountPoint:2822] mount point to be verified E:\
        [main] [ 2016-06-12 02:22:52.574 IST ] [OsUtilsBase.getMountPoint:2822] mount point to be verified D:\
        [main] [ 2016-06-12 02:22:52.574 IST ] [OsUtilsBase.getMountPoint:2822] mount point to be verified C:\
        [main] [ 2016-06-12 02:22:52.574 IST ] [StorageSpaceCheck.getConsolidatedMap:341] Mount point of C:\Oracle\oradata\E1Local\SYSAUX01.DBF\ is C:\
        [main] [ 2016-06-12 02:22:52.574 IST ] [StorageSpaceCheck.getConsolidatedMap:312] locationString processed: C:\Oracle\oradata\E1Local original String: C:\Oracle\oradata\E1Local\
        [main] [ 2016-06-12 02:22:52.574 IST ] [HAUtils.getCurrentOracleHome:593] Oracle home from system property: C:\Oracle\E1Local
        [main] [ 2016-06-12 02:22:52.574 IST ] [HAUtils.getConfiguredGridHome:1343] —– Getting CRS HOME —-
        [main] [ 2016-06-12 02:22:52.574 IST ] [WindowsSystem.getCRSHome:1809] olrKey = HKEY_LOCAL_MACHINE\Software\Oracle\Olr
        [main] [ 2016-06-12 02:22:52.574 IST ] [WindowsSystem.regKeyExists:1343] WindowsSystem.regKeyExists: mainkey= HKEY_LOCAL_MACHINE subkey = Software\Oracle\Olr
        [main] [ 2016-06-12 02:22:52.574 IST ] [HAUtils.getHASHome:1500] Failed to get HAS home.
        PRCI-1144 : Failed to retrieve Oracle Grid Infrastructure home path
        PRKN-1036 : Windows registry key “HKEY_LOCAL_MACHINE\Software\Oracle\Olr” not found on node “localnode”
        [main] [ 2016-06-12 02:22:52.574 IST ] [HAUtils.isPathOnACFS:3995] isPathOnACFS: false
        [main] [ 2016-06-12 02:22:52.574 IST ] [OsUtilsBase.getMountPoint:2822] mount point to be verified H:\
        [main] [ 2016-06-12 02:22:52.574 IST ] [OsUtilsBase.getMountPoint:2822] mount point to be verified G:\
        [main] [ 2016-06-12 02:22:52.574 IST ] [OsUtilsBase.getMountPoint:2822] mount point to be verified F:\
        [main] [ 2016-06-12 02:22:52.574 IST ] [OsUtilsBase.getMountPoint:2822] mount point to be verified E:\
        [main] [ 2016-06-12 02:22:52.574 IST ] [OsUtilsBase.getMountPoint:2822] mount point to be verified D:\
        [main] [ 2016-06-12 02:22:52.574 IST ] [OsUtilsBase.getMountPoint:2822] mount point to be verified C:\
        [main] [ 2016-06-12 02:22:52.574 IST ] [StorageSpaceCheck.getConsolidatedMap:341] Mount point of C:\Oracle\oradata\E1Local\ is C:\
        [main] [ 2016-06-12 02:22:52.574 IST ] [StorageSpaceCheck.getConsolidatedMap:312] locationString processed: C:\Oracle\oradata\E1Local\UNDOTBS01.DBF original String: C:\Oracle\oradata\E1Local\UNDOTBS01.DBF\
        [main] [ 2016-06-12 02:22:52.574 IST ] [HAUtils.getCurrentOracleHome:593] Oracle home from system property: C:\Oracle\E1Local
        [main] [ 2016-06-12 02:22:52.574 IST ] [HAUtils.getConfiguredGridHome:1343] —– Getting CRS HOME —-
        [main] [ 2016-06-12 02:22:52.574 IST ] [WindowsSystem.getCRSHome:1809] olrKey = HKEY_LOCAL_MACHINE\Software\Oracle\Olr
        [main] [ 2016-06-12 02:22:52.574 IST ] [WindowsSystem.regKeyExists:1343] WindowsSystem.regKeyExists: mainkey= HKEY_LOCAL_MACHINE subkey = Software\Oracle\Olr
        [main] [ 2016-06-12 02:22:52.574 IST ] [HAUtils.getHASHome:1500] Failed to get HAS home.
        PRCI-1144 : Failed to retrieve Oracle Grid Infrastructure home path
        PRKN-1036 : Windows registry key “HKEY_LOCAL_MACHINE\Software\Oracle\Olr” not found on node “localnode”
        [main] [ 2016-06-12 02:22:52.589 IST ] [HAUtils.isPathOnACFS:3995] isPathOnACFS: false
        [main] [ 2016-06-12 02:22:52.589 IST ] [OsUtilsBase.getMountPoint:2822] mount point to be verified H:\
        [main] [ 2016-06-12 02:22:52.589 IST ] [OsUtilsBase.getMountPoint:2822] mount point to be verified G:\
        [main] [ 2016-06-12 02:22:52.589 IST ] [OsUtilsBase.getMountPoint:2822] mount point to be verified F:\
        [main] [ 2016-06-12 02:22:52.589 IST ] [OsUtilsBase.getMountPoint:2822] mount point to be verified E:\
        [main] [ 2016-06-12 02:22:52.589 IST ] [OsUtilsBase.getMountPoint:2822] mount point to be verified D:\
        [main] [ 2016-06-12 02:22:52.589 IST ] [OsUtilsBase.getMountPoint:2822] mount point to be verified C:\
        [main] [ 2016-06-12 02:22:52.589 IST ] [StorageSpaceCheck.getConsolidatedMap:341] Mount point of C:\Oracle\oradata\E1Local\UNDOTBS01.DBF\ is C:\
        [main] [ 2016-06-12 02:22:52.589 IST ] [StorageSpaceCheck.validate:136] Checking storage space in C:\
        [main] [ 2016-06-12 02:22:52.589 IST ] [HAUtils.getCurrentOracleHome:593] Oracle home from system property: C:\Oracle\E1Local
        [main] [ 2016-06-12 02:22:52.589 IST ] [HAUtils.getConfiguredGridHome:1343] —– Getting CRS HOME —-
        [main] [ 2016-06-12 02:22:52.589 IST ] [WindowsSystem.getCRSHome:1809] olrKey = HKEY_LOCAL_MACHINE\Software\Oracle\Olr
        [main] [ 2016-06-12 02:22:52.589 IST ] [WindowsSystem.regKeyExists:1343] WindowsSystem.regKeyExists: mainkey= HKEY_LOCAL_MACHINE subkey = Software\Oracle\Olr
        [main] [ 2016-06-12 02:22:52.589 IST ] [HAUtils.getHASHome:1500] Failed to get HAS home.
        PRCI-1144 : Failed to retrieve Oracle Grid Infrastructure home path
        PRKN-1036 : Windows registry key “HKEY_LOCAL_MACHINE\Software\Oracle\Olr” not found on node “localnode”
        [main] [ 2016-06-12 02:22:52.589 IST ] [HAUtils.isPathOnACFS:3995] isPathOnACFS: false
        [main] [ 2016-06-12 02:22:52.589 IST ] [StorageSpaceCheck.validate:165] C:\ isACFSMountPoint: false
        [main] [ 2016-06-12 02:22:52.589 IST ] [StorageSpaceCheck.parseSpaceResult:385] actual: 133885 location: C:\ mandatorySpace: 3505 optionalSpace: 0
        [main] [ 2016-06-12 02:22:52.605 IST ] [Verifier.validateBackend:1035] Validation Result:
        C:\ has enough space. Required space is 3505 MB , available space is 133885 MB.
        Specified file “C:\ORACLE\ORADATA\E1LOCAL\SYSAUX01.DBF” already exists.
        Specified file “C:\ORACLE\ORADATA\E1LOCAL\UNDOTBS01.DBF” already exists.
        Specified file “C:\ORACLE\ORADATA\E1LOCAL\SYSTEM01.DBF” already exists.
        Specified file “C:\ORACLE\ORADATA\E1LOCAL\USERS01.DBF” already exists.
        Specified file “C:\ORACLE\ORADATA\E1LOCAL\TEMP01.DBF” already exists.
        [main] [ 2016-06-12 02:22:52.605 IST ] [Host.validate:5353] returning false based on backend check
        [main] [ 2016-06-12 02:22:52.605 IST ] [Host.cleanup:3933] Dbca exit status is: 1
        [main] [ 2016-06-12 02:22:52.605 IST ] [Host.cleanup:3936] check point context null
        [main] [ 2016-06-12 02:22:52.620 IST ] [InventoryUtil.getOUIInvSession:349] setting OUI READ level to ACCESSLEVEL_READ_LOCKLESS
        [main] [ 2016-06-12 02:22:52.620 IST ] [InventoryUtil.getHomeName:113] homeName = E1Local
        [main] [ 2016-06-12 02:22:52.620 IST ] [OsUtilsBase.getBaseFromOrabase:659] oraBaseUtility C:\Oracle\E1Local\bin\orabase.exe
        [main] [ 2016-06-12 02:22:52.620 IST ] [OsUtilsBase.getBaseFromOrabase:668] cmds: C:\Oracle\E1Local\bin\orabase.exe
        [main] [ 2016-06-12 02:22:52.620 IST ] [OsUtilsBase.getBaseFromOrabase:672] envs: ORACLE_HOME=C:\Oracle\E1Local
        [main] [ 2016-06-12 02:22:52.792 IST ] [OsUtilsBase.getBaseFromOrabase:682] baseLocation from orabase
        C:\Oracle
        [main] [ 2016-06-12 02:22:52.792 IST ] [OsUtilsBase.getBaseFromOrabase:707] orabaseLocation= C:\Oracle
        [main] [ 2016-06-12 02:22:52.792 IST ] [OsUtilsBase.copyFile:1505] OsUtilsBase.copyFile:
        [main] [ 2016-06-12 02:22:52.808 IST ] [OsUtilsBase.copyFile:1553] **write of file at destination complete…
        [main] [ 2016-06-12 02:22:52.808 IST ] [OsUtilsBase.copyFile:1588] **file copy status:= true
        [main] [ 2016-06-12 02:22:52.808 IST ] [OsUtilsBase.deleteFile:1803] OsUtilsBase.deleteFile: C:\Oracle\cfgtoollogs\dbca\silent.log_2016-06-12_02-22-50-AM
        [Thread-12] [ 2016-06-12 02:22:52.808 IST ] [DbcaCleanupHook.run:44] Cleanup started
        [Thread-12] [ 2016-06-12 02:22:52.808 IST ] [OracleHome.cleanupDBOptionsIntance:1674] DB Options dummy instance sid=null
        [Thread-12] [ 2016-06-12 02:22:52.808 IST ] [DbcaCleanupHook.run:49] Cleanup ended

        VN:F [1.9.22_1171]
        Rating: 0 (from 0 votes)
        1. JDEClouds

          Looks like previous installation was not done properly.

          May be you can uninstall ( Clear the Files and Registry) and try to reinstall the E1local in different drive ( D or other drive )

          VN:F [1.9.22_1171]
          Rating: +1 (from 1 vote)
          1. Raj_00

            Hello JDEE1Tips Team,

            Thanks for your help. You guys are awesome

            The installation of EnterpriseOne Oracle 12c Database Engine was successful.

            Now just wanted to ask you that should I install Oracle 12c 32 bit Client again as I have tried to uninstall it previously.

            I have Installed Oracle 12c 32 bit Client twice and tried to uninstalled them :
            I can see it in product installed but have deleted all the component.

            Thanks a lot again for your help.

            VN:F [1.9.22_1171]
            Rating: 0 (from 0 votes)
          2. JDEClouds

            Your Inventory.xml is not cleared !

            Go to the location C:\Program Files (x86)\Oracle\Inventory\ContentsXML and open the inventory.xml and remove the unwanted Oracle_Home

            For example :

            home NAME=”OraClient12Home1_32bit” LOC=”D:\app\oracle\product\12.1.0\client_1″ TYPE=”O” IDX=”4″>

            Save the Inventory.xml and check and Let us know

            VN:F [1.9.22_1171]
            Rating: 0 (from 0 votes)
  36. Raj_00

    Thanks for the reply….but I don’t have the folder named “C:\Program Files (x86)\Oracle\Inventory_old”.

    I tried to open inventory.xml from “C:\Program Files (x86)\Oracle\Inventory\ContentsXML” but it doesnot contain any line as mentioned by you in example.

    it says :

    Does that mean I have to install Oracle 12c 32 bit Client again.

    Request your help!!

    VN:F [1.9.22_1171]
    Rating: 0 (from 0 votes)
    1. JDEClouds

      It is C:\Program Files (x86)\Oracle\Inventory\ContentsXML.

      VN:F [1.9.22_1171]
      Rating: 0 (from 0 votes)
      1. Raj_00

        Thanks JDEE1Tips!!!

        The Demo is installed successfully…

        But when I try to login I get error saying unable to Locate Security server…

        I tried the tip provided by you to Venkatesh & JulianoChamp above, and also I tried the tip in the Troubleshooting Guide page but unfortunately the error persist.

        Just to Inform you my Machine name contains ‘-‘, do I have to change the machine name.

        Also have sent you the alert log.

        Kindly help

        VN:F [1.9.22_1171]
        Rating: 0 (from 0 votes)
        1. JDEClouds

          Can you please share the jde.log ?

          VN:F [1.9.22_1171]
          Rating: 0 (from 0 votes)
  37. Nishant Sharma

    I’m not able to install Database 12C and getting following error:

    SEVERE: [FATAL] [INS-30131] Initial setup required for the execution of installer validations failed.
    CAUSE: Failed to access the temporary location.
    ACTION: Ensure that the current user has required permissions to access the temporary location.

    I have log files too.

    VN:F [1.9.22_1171]
    Rating: 0 (from 0 votes)
  38. Nishant Sharma

    {\rtf1\ansi\ansicpg1252\deff0\deflang1033{\fonttbl{\f0\fnil\fcharset0 Calibri;}}
    {\*\generator Msftedit 5.41.21.2510;}\viewkind4\uc1\pard\sa200\sl276\slmult1\lang9\f0\fs22 INFO: Loading data from: jar:file:/C:/Users/E920DEMO/AppData/Local/Temp/OraInstall2016-06-15_11-01-38PM/ext/jlib/installcommons_1.0.0b.jar!/oracle/install/driver/oui/resource/ConfigCommandMappings.xml\par
    INFO: Loading beanstore from jar:file:/C:/Users/E920DEMO/AppData/Local/Temp/OraInstall2016-06-15_11-01-38PM/ext/jlib/installcommons_1.0.0b.jar!/oracle/install/driver/oui/resource/ConfigCommandMappings.xml\par
    INFO: Restoring class oracle.install.driver.oui.ConfigCmdMappings from jar:file:/C:/Users/E920DEMO/AppData/Local/Temp/OraInstall2016-06-15_11-01-38PM/ext/jlib/installcommons_1.0.0b.jar!/oracle/install/driver/oui/resource/ConfigCommandMappings.xml\par
    INFO: Loading beans from Xml Bean Store. [BeanStoreName:config-data]\par
    INFO: Setting value for the property:id in the bean:configcmd\par
    INFO: Setting value for the property:platformcmdmap in the bean:configcmd\par
    INFO: Setting value for the property:id in the bean:configcmd\par
    INFO: Setting value for the property:platformcmdmap in the bean:configcmd\par
    INFO: Setting value for the property:id in the bean:configcmd\par
    INFO: Setting value for the property:platformcmdmap in the bean:configcmd\par
    INFO: Setting value for the property:id in the bean:configcmd\par
    INFO: Setting value for the property:platformcmdmap in the bean:configcmd\par
    INFO: Setting value for the property:id in the bean:configcmd\par
    INFO: Setting value for the property:platformcmdmap in the bean:configcmd\par
    INFO: Setting value for the property:id in the bean:configcmd\par
    INFO: Setting value for the property:platformcmdmap in the bean:configcmd\par
    INFO: Setting value for the property:id in the bean:configcmd\par
    INFO: Setting value for the property:platformcmdmap in the bean:configcmd\par
    INFO: Setting value for the property:id in the bean:configcmd\par
    INFO: Setting value for the property:platformcmdmap in the bean:configcmd\par
    INFO: Setting value for the property:id in the bean:configcmd\par
    INFO: Setting value for the property:platformcmdmap in the bean:configcmd\par
    INFO: Setting value for the property:id in the bean:configcmd\par
    INFO: Setting value for the property:platformcmdmap in the bean:configcmd\par
    INFO: Setting value for the property:id in the bean:configcmd\par
    INFO: Setting value for the property:platformcmdmap in the bean:configcmd\par
    INFO: Setting value for the property:id in the bean:configcmd\par
    INFO: Setting value for the property:platformcmdmap in the bean:configcmd\par
    INFO: Setting value for the property:id in the bean:configcmd\par
    INFO: Setting value for the property:platformcmdmap in the bean:configcmd\par
    INFO: Setting value for the property:configcmds in the bean:configcmdmappings\par
    INFO: Inventory exists: false\par
    INFO: Gathering system details…\par
    INFO: Registering setup bean\par
    INFO: Building Flow\par
    INFO: Opening bean stores from which the beans can be loaded\par
    INFO: Loading beanstore from a given input stream\par
    WARNING: Unable to create xml tag for the key:CommonProgramFiles(x86)\par
    WARNING: Unable to create xml tag for the key:ProgramFiles(x86)\par
    INFO: Translating external format into raw format \par
    INFO: No global condition definition found.\par
    INFO: Building the flow graph\par
    INFO: Loaded state AutoUpdatesOptionsUI\par
    INFO: Loaded state UpdatesListUI\par
    INFO: Loaded state finishupdates\par
    INFO: Building the flow graph\par
    INFO: Loaded state init\par
    INFO: Loaded state installModeDecider\par
    INFO: Loaded state clientInstallType\par
    INFO: Loaded state autoupdatesDecider\par
    INFO: Loaded state clientInstallMode\par
    INFO: Loaded state AutoUpdatesOptionsUI\par
    INFO: Loaded state UpdatesListUI\par
    INFO: Loaded state clientSupportedOSCheck\par
    INFO: Loaded state productLanguage\par
    INFO: Loaded state getOracleHome\par
    INFO: Loaded state getWindowsSecureOptionDetails\par
    INFO: Loaded state prereqExecutionDecider\par
    INFO: Loaded state checkPrereqs\par
    INFO: Loaded state postPrereqs\par
    INFO: Loaded state summary\par
    INFO: Loaded state clientCustomInstall\par
    INFO: Loaded state schedulerAgent\par
    INFO: Loaded state mtsDialog\par
    INFO: Loaded state setup\par
    INFO: Loaded state finish\par
    INFO: Linking states \par
    INFO: State[AutoUpdatesOptionsUI]: route=NO_AUTO_UPDATES; to=clientSupportedOSCheck\par
    INFO: State[AutoUpdatesOptionsUI]: route=success; to=UpdatesListUI\par
    INFO: State[UpdatesListUI]: route=success; to=clientSupportedOSCheck\par
    INFO: State[autoupdatesDecider]: route=AUTO_UPDATES_DISABLE; to=clientSupportedOSCheck\par
    INFO: State[autoupdatesDecider]: route=AUTO_UPDATES_STATE_SKIP; to=clientSupportedOSCheck\par
    INFO: State[autoupdatesDecider]: route=success; to=AutoUpdatesOptionsUI\par
    INFO: Condition of state[autoupdatesDecider]: route=matched; to=clientSupportedOSCheck\par
    INFO: State[checkPrereqs]: route=success; to=summary\par
    INFO: State[clientCustomInstall]: route=TO_ENDCUSTOM; to=prereqExecutionDecider\par
    INFO: State[clientCustomInstall]: route=TO_ORAMTS; to=mtsDialog\par
    INFO: State[clientCustomInstall]: route=TO_SCHEDULERAGENT; to=schedulerAgent\par
    INFO: State[clientInstallMode]: route=UPGRADE_NO; to=clientInstallType\par
    INFO: State[clientInstallMode]: route=UPGRADE_YES; to=getWindowsSecureOptionDetails\par
    INFO: Condition of state[clientInstallMode]: route=mismatched; to=clientInstallType\par
    INFO: State[clientInstallType]: route=ic_no; to=autoupdatesDecider\par
    INFO: State[clientInstallType]: route=ic_yes; to=clientSupportedOSCheck\par
    INFO: State[clientSupportedOSCheck]: route=ic_yes; to=getOracleHome\par
    INFO: State[clientSupportedOSCheck]: route=success; to=productLanguage\par
    INFO: State[getOracleHome]: route=ICHOME_SELECTED; to=prereqExecutionDecider\par
    INFO: State[getOracleHome]: route=INVENTORY_NO; to=prereqExecutionDecider\par
    INFO: State[getOracleHome]: route=INVENTORY_NO_CUSTOM_YES; to=clientCustomInstall\par
    INFO: State[getOracleHome]: route=INVENTORY_YES; to=prereqExecutionDecider\par
    INFO: State[getOracleHome]: route=INVENTORY_YES_CUSTOM_YES; to=clientCustomInstall\par
    INFO: State[getOracleHome]: route=NON_ICHOME_SELECTED; to=autoupdatesDecider\par
    INFO: State[getWindowsSecureOptionDetails]: route=success; to=getOracleHome\par
    INFO: State[init]: route=DOWNLOAD_UPDATES_ONLY; to=AutoUpdatesOptionsUI\par
    INFO: State[init]: route=success; to=installModeDecider\par
    INFO: State[installModeDecider]: route=UPGRADE_IMPOSSIBLE; to=clientInstallType\par
    INFO: State[installModeDecider]: route=UPGRADE_POSSIBLE; to=clientInstallMode\par
    INFO: State[mtsDialog]: route=success; to=prereqExecutionDecider\par
    INFO: State[postPrereqs]: route=CUSTOM; to=clientCustomInstall\par
    INFO: State[postPrereqs]: route=NON_CUSTOM; to=summary\par
    INFO: State[prereqExecutionDecider]: route=executeprereqs; to=checkPrereqs\par
    INFO: State[prereqExecutionDecider]: route=ignoreprereqs; to=summary\par
    INFO: State[productLanguage]: route=UPGRADE_ROUTE; to=prereqExecutionDecider\par
    INFO: State[productLanguage]: route=productlanguage_yes; to=getWindowsSecureOptionDetails\par
    INFO: State[schedulerAgent]: route=TO_ENDCUSTOM; to=prereqExecutionDecider\par
    INFO: State[schedulerAgent]: route=TO_ORAMTS; to=mtsDialog\par
    INFO: State[setup]: route=success; to=finish\par
    INFO: State[summary]: route=success; to=setup\par
    INFO: State[AutoUpdatesOptionsUI]: route=NO_AUTO_UPDATES; to=finishupdates\par
    INFO: State[AutoUpdatesOptionsUI]: route=success; to=UpdatesListUI\par
    INFO: State[UpdatesListUI]: route=DOWNLOAD_UPDATES_FINISHED; to=finishupdates\par
    INFO: Successfully built the flow\par
    INFO: loading the beans from bean stores\par
    INFO: Loading flow data beans\par
    INFO: Loading beans from Properties Bean Store. [BeanStoreName:beanstore]\par
    INFO: Setting value for the property:ClientInstallSettings in the bean:ClientSetupBean\par
    INFO: Setting value for the property:oracle_install_autoupdates_myOracleSupportCredentials in the bean:AutoUpdatesInstallSettings\par
    INFO: Setting value for the property:oracle_install_autoupdates_httpProxySettings in the bean:AutoUpdatesInstallSettings\par
    INFO: Setting value for the property:AutoUpdatesInstallSettings in the bean:ClientSetupBean\par
    INFO: Setting value for the property:CentralInventorySettings in the bean:ClientSetupBean\par
    INFO: Setting value for the property:WindowsSecureOptionSettings in the bean:ClientSetupBean\par
    INFO: Setting value for the property:OCMSettings in the bean:ClientSetupBean\par
    INFO: Setting value for the property:RootConfigurationSettings in the bean:ClientSetupBean\par
    INFO: Loading beans from Xml Bean Store. [BeanStoreName:beanstore]\par
    INFO: Setting value for the property:ClientInstallSettings in the bean:ClientSetupBean\par
    INFO: Setting value for the property:oracle_install_autoupdates_myOracleSupportCredentials in the bean:AutoUpdatesInstallSettings\par
    INFO: Setting value for the property:oracle_install_autoupdates_httpProxySettings in the bean:AutoUpdatesInstallSettings\par
    INFO: Setting value for the property:AutoUpdatesInstallSettings in the bean:ClientSetupBean\par
    INFO: Setting value for the property:CentralInventorySettings in the bean:ClientSetupBean\par
    INFO: Setting value for the property:WindowsSecureOptionSettings in the bean:ClientSetupBean\par
    INFO: Set value for bean ClientSetupBean\par
    INFO: Loading beans from Properties Bean Store. [BeanStoreName:beanstore]\par
    INFO: Loading beans from Xml Bean Store. [BeanStoreName:beanstore]\par
    INFO: Loading beans from Properties Bean Store. [BeanStoreName:beanstore]\par
    INFO: Setting value for the property:oracle_install_autoupdates_myOracleSupportCredentials in the bean:AutoUpdatesInstallSettings\par
    INFO: Setting value for the property:oracle_install_autoupdates_httpProxySettings in the bean:AutoUpdatesInstallSettings\par
    INFO: Loading beans from Xml Bean Store. [BeanStoreName:beanstore]\par
    INFO: Loading beans from Properties Bean Store. [BeanStoreName:beanstore]\par
    INFO: Loading beans from Xml Bean Store. [BeanStoreName:beanstore]\par
    INFO: Closing bean stores from which the beans can be loaded\par
    INFO: Registering the flow views\par
    INFO: Adding View[type: oracle.install.commons.base.interview.common.view.PrereqGUI viewId: null uiType: null]\par
    INFO: oracle.install.commons.base.interview.common.view.PrereqGUI added to View Type Registry with the key as [PrereqUI]\par
    INFO: Adding View[type: oracle.install.commons.base.interview.common.view.SummaryGUI viewId: null uiType: null]\par
    INFO: oracle.install.commons.base.interview.common.view.SummaryGUI added to View Type Registry with the key as [SummaryUI]\par
    INFO: Adding View[type: oracle.install.commons.base.interview.common.view.SetupGUI viewId: null uiType: null]\par
    INFO: oracle.install.commons.base.interview.common.view.SetupGUI added to View Type Registry with the key as [SetupUI]\par
    INFO: Adding View[type: oracle.install.ivw.client.view.WindowsSecureOptionUI viewId: WindowsSecureOptionUI uiType: null]\par
    INFO: oracle.install.ivw.client.view.WindowsSecureOptionUI added to View Type Registry with the key as [WindowsSecureOptionUI]\par
    INFO: Adding View[type: oracle.install.ivw.common.view.ProductLanguageGUI viewId: ProductLanguageUI uiType: null]\par
    INFO: oracle.install.ivw.common.view.ProductLanguageGUI added to View Type Registry with the key as [ProductLanguageUI]\par
    INFO: Adding View[type: oracle.install.ivw.client.view.CustomInstallGUI viewId: null uiType: null]\par
    INFO: oracle.install.ivw.client.view.CustomInstallGUI added to View Type Registry with the key as [CustomInstallUI]\par
    INFO: Adding View[type: oracle.install.ivw.client.view.SchedulerAgentGUI viewId: null uiType: null]\par
    INFO: oracle.install.ivw.client.view.SchedulerAgentGUI added to View Type Registry with the key as [SchedulerAgentUI]\par
    INFO: Adding View[type: oracle.install.ivw.client.view.InstallLocationGUI viewId: null uiType: null]\par
    INFO: oracle.install.ivw.client.view.InstallLocationGUI added to View Type Registry with the key as [InstallLocationUI]\par
    INFO: Adding View[type: oracle.install.ivw.client.view.InstallTypesGUI viewId: null uiType: null]\par
    INFO: oracle.install.ivw.client.view.InstallTypesGUI added to View Type Registry with the key as [InstallTypesUI]\par
    INFO: Adding View[type: oracle.install.ivw.client.view.InstallModeGUI viewId: null uiType: null]\par
    INFO: oracle.install.ivw.client.view.InstallModeGUI added to View Type Registry with the key as [InstallModeUI]\par
    INFO: Adding View[type: oracle.install.ivw.client.view.FinishGUI viewId: null uiType: null]\par
    INFO: oracle.install.ivw.client.view.FinishGUI added to View Type Registry with the key as [FinishUI]\par
    INFO: Adding View[type: oracle.install.ivw.common.view.AutoUpdatesOptionsUI viewId: AutoUpdatesOptionsUI uiType: null]\par
    INFO: oracle.install.ivw.common.view.AutoUpdatesOptionsUI added to View Type Registry with the key as [AutoUpdatesOptionsUI]\par
    INFO: Adding View[type: oracle.install.ivw.common.view.UpdatesListUI viewId: UpdatesListUI uiType: null]\par
    INFO: oracle.install.ivw.common.view.UpdatesListUI added to View Type Registry with the key as [UpdatesListUI]\par
    INFO: Adding View[type: oracle.install.ivw.common.view.FinishUpdatesUI viewId: FinishUpdatesUI uiType: null]\par
    INFO: oracle.install.ivw.common.view.FinishUpdatesUI added to View Type Registry with the key as [FinishUpdatesUI]\par
    INFO: Initial values of Setup Properties :\par
    —————————————————————————————————-\par
    PROPERTY VALUE \par
    —————————————————————————————————-\par
    AutoUpdatesInstallSettings oracle.install.ivw.common.bean.AutoUpdates \par
    [email protected] \par
    COLLECTOR_IGNORE_CONFIGURATION false \par
    COLLECTOR_IGNORE_FAILURES false \par
    COLLECTOR_RESPONSE_FILE \par
    CentralInventorySettings oracle.install.ivw.common.bean.CentralInve \par
    [email protected] \par
    ClientInstallSettings oracle.install.ivw.client.bean.ClientInsta \par
    [email protected] \par
    DECLINE_SECURITY_UPDATES false \par
    FROM_LOCATION C:\\Install\\Oracle 12C 32 bit Client\\client \par
    32\\install\\../stage/products.xml \par
    INSTALL_TYPE InstantClient \par
    MYORACLESUPPORT_PASSWORD *Protected value, not to be logged* \par
    MYORACLESUPPORT_USERNAME \par
    OCMSettings oracle.install.ivw.common.bean.OCMSettings \par
    @11f1f12 \par
    ORACLE_BASE \par
    ORACLE_HOME \par
    ORACLE_HOSTNAME DEMO \par
    PROXY_HOST \par
    PROXY_PORT \par
    PROXY_PWD *Protected value, not to be logged* \par
    PROXY_USER \par
    RootConfigurationSettings oracle.install.ivw.common.bean.RootConfigu \par
    [email protected] \par
    SECURITY_UPDATES_VIA_MYORACLESUPPORT true \par
    SELECTED_LANGUAGES \{“en”\} \par
    WindowsSecureOptionSettings oracle.install.ivw.common.bean.WindowsSecu \par
    [email protected] \par
    b_schedulerAgentSelected false \par
    oracle_install_IsBuiltInAccount false \par
    oracle_install_IsOracleServiceUserExists false \par
    oracle_install_LaunchNetCA false \par
    oracle_install_NoMigration true \par
    oracle_install_ProductName \par
    oracle_install_RACInstall false \par
    oracle_install_WindowsSystemDirectory \par
    oracle_install_autoupdates_httpProxyPort 0 \par
    oracle_install_autoupdates_httpProxySettings oracle.install.ivw.common.bean.HttpProxySe \par
    [email protected] \par
    oracle_install_autoupdates_myOracleSupportCredentials oracle.install.ivw.common.bean.MyOracleSup \par
    [email protected] \par
    oracle_install_client_upgrading false \par
    oracle_install_db_ConfigurationType \par
    oracle_install_db_InstallEdition EE \par
    oracle_install_db_InstallType \par
    oracle_install_rootConfiguration_ExecuteRootScript false \par
    —————————————————————————————————-\par
    \par
    INFO: Launching Oracle Database Client 12c Release 1 Installer\par
    INFO: Started executing the flow in INTERACTIVE mode\par
    INFO: Waiting for completion of background operations\par
    INFO: Finishing all forked tasks at state init\par
    INFO: Waiting for completion all forked tasks at state init\par
    INFO: All forked task are completed at state init\par
    INFO: Completed background operations\par
    INFO: Executing action at state init\par
    INFO: Completed executing action at state \par
    INFO: Waiting for completion of background operations\par
    INFO: Completed background operations\par
    INFO: Moved to state \par
    INFO: Waiting for completion of background operations\par
    INFO: Completed background operations\par
    INFO: Validating view at state \par
    INFO: Completed validating view at state \par
    INFO: Validating state \par
    WARNING: Validation disabled for the state init\par
    INFO: Completed validating state \par
    INFO: Verifying route success\par
    INFO: Checking condition at state \par
    INFO: Successfully checked condition at state \par
    INFO: Condition matched at state .\par
    INFO: Redirecting to route .\par
    INFO: Waiting for completion of background operations\par
    INFO: Completed background operations\par
    INFO: Executing action at state installModeDecider\par
    INFO: Completed executing action at state \par
    INFO: Waiting for completion of background operations\par
    INFO: Completed background operations\par
    INFO: Moved to state \par
    INFO: Waiting for completion of background operations\par
    INFO: Completed background operations\par
    INFO: Validating view at state \par
    INFO: Completed validating view at state \par
    INFO: Validating state \par
    WARNING: Validation disabled for the state installModeDecider\par
    INFO: Completed validating state \par
    INFO: Verifying route UPGRADE_IMPOSSIBLE\par
    INFO: Get view named [InstallTypesUI]\par
    INFO: size estimation for InstantClientinstall is 214.0\par
    INFO: size estimation for Administratorinstall is 1024.0\par
    INFO: size estimation for Runtimeinstall is 735.0\par
    INFO: View for [InstallTypesUI] is [email protected]\par
    INFO: Initializing view at state \par
    INFO: InstallTypesPane installType is: InstantClient\par
    INFO: Completed initializing view at state \par
    INFO: Displaying view at state \par
    INFO: Completed displaying view at state \par
    INFO: Loading view at state \par
    INFO: Completed loading view at state \par
    INFO: Localizing view at state \par
    INFO: size estimation for InstantClientinstall is 214.0\par
    INFO: size estimation for Administratorinstall is 1024.0\par
    INFO: size estimation for Runtimeinstall is 735.0\par
    INFO: Completed localizing view at state \par
    INFO: Waiting for completion of background operations\par
    INFO: Completed background operations\par
    INFO: Executing action at state clientInstallType\par
    INFO: Completed executing action at state \par
    INFO: Waiting for completion of background operations\par
    INFO: Completed background operations\par
    INFO: Moved to state \par
    INFO: Waiting for completion of background operations\par
    INFO: Completed background operations\par
    INFO: Client Install Type set in InstallTypeUI is : Administrator\par
    INFO: Validating view at state \par
    INFO: Completed validating view at state \par
    INFO: Validating state \par
    WARNING: Validation disabled for the state clientInstallType\par
    INFO: Completed validating state \par
    INFO: In Transition of InstallTypesAction:\par
    INFO: Verifying route ic_no\par
    INFO: Checking condition at state \par
    INFO: Successfully checked condition at state \par
    INFO: Condition matched at state .\par
    INFO: Redirecting to route .\par
    INFO: Waiting for completion of background operations\par
    INFO: Completed background operations\par
    INFO: Executing action at state clientSupportedOSCheck\par
    INFO: Completed executing action at state \par
    INFO: Waiting for completion of background operations\par
    INFO: Completed background operations\par
    INFO: Moved to state \par
    INFO: Waiting for completion of background operations\par
    INFO: Completed background operations\par
    INFO: Validating view at state \par
    INFO: Completed validating view at state \par
    INFO: Validating state \par
    INFO: Verifying target environment…\par
    INFO: Checking whether the IP address of the localhost could be determined…\par
    SEVERE: CVU do not support target environment..\par
    Refer associated stacktrace #oracle.install.ivw.common.validator.SupportedOSValidator:268\par
    INFO: Completed verification of target environment.\par
    WARNING: Verification of target environment returned with errors.\par
    WARNING: [WARNING] [INS-13001] Environment does not meet minimum requirements.\par
    CAUSE: Minimum requirements were not met for this environment\par
    ACTION: Either check the logs for more information or check the supported configurations for this product..\par
    Refer associated stacktrace #oracle.install.commons.util.exception.DefaultErrorAdvisor:271\par
    INFO: Advice is CONTINUE\par
    WARNING: Advised to ignore target environment verification errors.\par
    INFO: Verifying setup for installer validations\par
    INFO: Overall status of CVU API call:OPERATION_FAILED\par
    SEVERE: [FATAL] [INS-30131] Initial setup required for the execution of installer validations failed.\par
    CAUSE: Failed to access the temporary location.\par
    ACTION: Ensure that the current user has required permissions to access the temporary location.\par
    *ADDITIONAL INFORMATION:*\par
    \~-\~Framework setup check failed on all the nodes\par
    \~-\~Cause:\~Cause Of Problem Not Available\par
    \~-\~Action:\~User Action Not Available\par
    Summary of the failed nodes\par
    demo\par
    \~-\~Version of exectask could not be retrieved from node “demo”\par
    \~-\~Cause:\~Cause Of Problem Not Available\par
    \~-\~Action:\~User Action Not Available\par
    \par
    INFO: Advice is ABORT\par
    INFO: Adding ExitStatus INVALID_USER_INPUT to the exit status set\par
    INFO: Completed validating state \par
    INFO: Terminating all background operations\par
    INFO: Terminated all background operations\par
    INFO: Transition aborted\par
    INFO: Rolled back to state \par
    INFO: Pause Oracle Database Client 12c Release 1 Installer\par
    INFO: Resume Oracle Database Client 12c Release 1 Installer\par
    INFO: Adding ExitStatus USER_CANCELLED_INSTALL to the exit status set\par
    INFO: Finding the most appropriate exit status for the current application\par
    INFO: Exit Status is 4\par
    INFO: Shutdown Oracle Database Client 12c Release 1 Installer\par
    }

    VN:F [1.9.22_1171]
    Rating: 0 (from 0 votes)
  39. Nishant Sharma

    {\rtf1\ansi\ansicpg1252\deff0\deflang1033{\fonttbl{\f0\fnil\fcharset0 Calibri;}}
    {\*\generator Msftedit 5.41.21.2510;}\viewkind4\uc1\pard\sa200\sl276\slmult1\lang9\f0\fs22 —# Begin Stacktrace #—————————\par
    ID: oracle.install.ivw.common.validator.SupportedOSValidator:268\par
    oracle.cluster.verification.PreReqNotSupportedException: Reference data is not available for release “12.1” on the operating system distribution “Windows XP5.1″\par
    \tab at oracle.cluster.verification.constraints.XmlTaskFactory.getTasks(XmlTaskFactory.java:370)\par
    \tab at oracle.cluster.verification.constraints.XmlTaskFactory.getTasks(XmlTaskFactory.java:212)\par
    \tab at oracle.cluster.verification.constraints.XmlTaskFactory.getTasks(XmlTaskFactory.java:194)\par
    \tab at oracle.ops.verification.framework.util.VerificationUtil.isPreReqSupported(VerificationUtil.java:9499)\par
    \tab at oracle.ops.verification.framework.util.VerificationUtil.isPreReqSupported(VerificationUtil.java:9448)\par
    \tab at oracle.cluster.verification.ClusterVerification.isPreReqSupported(ClusterVerification.java:7796)\par
    \tab at oracle.install.library.util.cvu.CVUHelper.isPreReqSupported(CVUHelper.java:398)\par
    \tab at oracle.install.ivw.common.validator.SupportedOSValidator.verifyEnvironment(SupportedOSValidator.java:67)\par
    \tab at oracle.install.ivw.common.validator.SupportedOSValidator.validate(SupportedOSValidator.java:94)\par
    \tab at oracle.install.commons.flow.validation.ValidationHelper.validateState(ValidationHelper.java:188)\par
    \tab at oracle.install.commons.flow.AbstractFlowExecutor.validate(AbstractFlowExecutor.java:420)\par
    \tab at oracle.install.commons.flow.AbstractFlowExecutor.leaveVertex(AbstractFlowExecutor.java:644)\par
    \tab at oracle.install.commons.flow.AbstractFlowExecutor.transition(AbstractFlowExecutor.java:336)\par
    \tab at oracle.install.commons.flow.AbstractFlowExecutor.nextState(AbstractFlowExecutor.java:276)\par
    \tab at oracle.install.commons.flow.AbstractFlowExecutor.nextViewState(AbstractFlowExecutor.java:235)\par
    \tab at oracle.install.commons.flow.DefaultFlowNavigator.goForward(DefaultFlowNavigator.java:58)\par
    \tab at oracle.install.commons.flow.jewt.FlowWizard$1.run(FlowWizard.java:137)\par
    \tab at oracle.install.commons.flow.jewt.FlowWizard$TransitionManager$1.run(FlowWizard.java:113)\par
    \tab at java.util.concurrent.Executors$RunnableAdapter.call(Executors.java:439)\par
    \tab at java.util.concurrent.FutureTask$Sync.innerRun(FutureTask.java:303)\par
    \tab at java.util.concurrent.FutureTask.run(FutureTask.java:138)\par
    \tab at java.util.concurrent.ThreadPoolExecutor$Worker.runTask(ThreadPoolExecutor.java:895)\par
    \tab at java.util.concurrent.ThreadPoolExecutor$Worker.run(ThreadPoolExecutor.java:918)\par
    \tab at java.lang.Thread.run(Thread.java:682)\par
    \par
    —# End Stacktrace #—————————–\par
    —# Begin Stacktrace #—————————\par
    ID: oracle.install.commons.util.exception.DefaultErrorAdvisor:271\par
    oracle.cluster.verification.PreReqNotSupportedException: Reference data is not available for release “12.1” on the operating system distribution “Windows XP5.1″\par
    \tab at oracle.cluster.verification.constraints.XmlTaskFactory.getTasks(XmlTaskFactory.java:370)\par
    \tab at oracle.cluster.verification.constraints.XmlTaskFactory.getTasks(XmlTaskFactory.java:212)\par
    \tab at oracle.cluster.verification.constraints.XmlTaskFactory.getTasks(XmlTaskFactory.java:194)\par
    \tab at oracle.ops.verification.framework.util.VerificationUtil.isPreReqSupported(VerificationUtil.java:9499)\par
    \tab at oracle.ops.verification.framework.util.VerificationUtil.isPreReqSupported(VerificationUtil.java:9448)\par
    \tab at oracle.cluster.verification.ClusterVerification.isPreReqSupported(ClusterVerification.java:7796)\par
    \tab at oracle.install.library.util.cvu.CVUHelper.isPreReqSupported(CVUHelper.java:398)\par
    \tab at oracle.install.ivw.common.validator.SupportedOSValidator.verifyEnvironment(SupportedOSValidator.java:67)\par
    \tab at oracle.install.ivw.common.validator.SupportedOSValidator.validate(SupportedOSValidator.java:94)\par
    \tab at oracle.install.commons.flow.validation.ValidationHelper.validateState(ValidationHelper.java:188)\par
    \tab at oracle.install.commons.flow.AbstractFlowExecutor.validate(AbstractFlowExecutor.java:420)\par
    \tab at oracle.install.commons.flow.AbstractFlowExecutor.leaveVertex(AbstractFlowExecutor.java:644)\par
    \tab at oracle.install.commons.flow.AbstractFlowExecutor.transition(AbstractFlowExecutor.java:336)\par
    \tab at oracle.install.commons.flow.AbstractFlowExecutor.nextState(AbstractFlowExecutor.java:276)\par
    \tab at oracle.install.commons.flow.AbstractFlowExecutor.nextViewState(AbstractFlowExecutor.java:235)\par
    \tab at oracle.install.commons.flow.DefaultFlowNavigator.goForward(DefaultFlowNavigator.java:58)\par
    \tab at oracle.install.commons.flow.jewt.FlowWizard$1.run(FlowWizard.java:137)\par
    \tab at oracle.install.commons.flow.jewt.FlowWizard$TransitionManager$1.run(FlowWizard.java:113)\par
    \tab at java.util.concurrent.Executors$RunnableAdapter.call(Executors.java:439)\par
    \tab at java.util.concurrent.FutureTask$Sync.innerRun(FutureTask.java:303)\par
    \tab at java.util.concurrent.FutureTask.run(FutureTask.java:138)\par
    \tab at java.util.concurrent.ThreadPoolExecutor$Worker.runTask(ThreadPoolExecutor.java:895)\par
    \tab at java.util.concurrent.ThreadPoolExecutor$Worker.run(ThreadPoolExecutor.java:918)\par
    \tab at java.lang.Thread.run(Thread.java:682)\par
    \par
    —# End Stacktrace #—————————–\par
    }

    VN:F [1.9.22_1171]
    Rating: 0 (from 0 votes)
    1. JDEClouds

      Refer : https://community.oracle.com/thread/2567145?start=0&tstart=0

      Clear the Temp folder then restart the Machine then try to Install the Oracle 12c 32 bit client !

      VN:F [1.9.22_1171]
      Rating: 0 (from 0 votes)
      1. Nishant Sharma

        I have already tried all that many times…
        I’m installing a VM (Oracle Virtual Box). I searched and tried different options available on internet.

        I didn’t see any one face the same issue on this thread.

        VN:F [1.9.22_1171]
        Rating: 0 (from 0 votes)
        1. JDEClouds

          Thanks for confirming in the Mail that Enabling the Network settings of VM box resolved yous issue !

          VN:F [1.9.22_1171]
          Rating: 0 (from 0 votes)
  40. Raj_00

    Dear JDEE1tips Team,

    After installation, when I try to open UTB I get error saying
    ‘The program can’t start because EnvTool.dll is missing from your computer. Try reinstalling the program to fix this problem.’
    Any idea on this issue?
    Thanks for helping!!

    VN:F [1.9.22_1171]
    Rating: 0 (from 0 votes)
    1. JDEClouds

      You should have tow files DataUtils.dll and EnvTool.dll inside bin32 folder for UTB to function !

      VN:F [1.9.22_1171]
      Rating: 0 (from 0 votes)
  41. Nishant Kumar Sharma

    I installed E920 demo on a oracle virtual box, I’m not able to start Visual Studio C++. and getting error unable to start VC 7.1…….”, although I have installed VC 2013 successfully and working perfectly if launched separately.

    But when I tried to launch BSFN development using JDE getting this error.

    Can someone help?

    Thanks,
    Nishant

    VA:F [1.9.22_1171]
    Rating: 0 (from 0 votes)
    1. Nishant Sharma

      I guess, Its due to the express version, I’m trying professional version now.

      VN:F [1.9.22_1171]
      Rating: 0 (from 0 votes)
  42. Mukesh_Maurya

    hello…sir .
    i just install JDE E1 9.2 on windows 10 x64 …but i’m getting two error message:

    First error: “Could not find Web Server”
    followed by the second error: “Failed to launch E1 Menu on HTML Engine”
    please help….sir

    VN:F [1.9.22_1171]
    Rating: 0 (from 0 votes)
      1. anand0514

        Hi,
        I’m having the same issue as Mukesh, The logs folder doesn’t have any file there.
        Please help.
        Thanks,
        Anand

        VN:F [1.9.22_1171]
        Rating: 0 (from 0 votes)
        1. anand0514

          I’m running Win 7 64 bit

          VN:F [1.9.22_1171]
          Rating: 0 (from 0 votes)
  43. Mukesh_Maurya

    sorry..but I can’t find any files in this location..

    VN:F [1.9.22_1171]
    Rating: 0 (from 0 votes)
  44. Djohnson

    Hi guys,

    I need some help here. I am installing 9.2 and followed all the directions. When I get to installing the actual 9.2 Client I get the unable to connect to server.

    I have changed the Host to E1Local in the TNSNames and Listener.oras. I have changed the path variable to include BOTH paths as per above. I have renamed the two files as well.

    This is where it gets odd… First time I installed the Listener Service started with no issue. Now it keeps shutting down and I can’t keep it started.

    Any suggestions?

    VN:F [1.9.22_1171]
    Rating: 0 (from 0 votes)
    1. JDEClouds

      Hi,

      We will be happy to help you from this issue !

      Can you give us the below details ?
      1. InstallActions.log from C:\Program Files (x86)\Oracle\Inventory\logs folder
      2. Screenshot of the issue
      3. tnsnames.ora and listener.ora files

      You can send this information to [email protected].

      Best Regards
      JDEE1Tips

      VN:F [1.9.22_1171]
      Rating: 0 (from 0 votes)
  45. Raj_00

    Hi JDEETIPS,

    When try to login to JDE I am getting error ‘Unable to locate security server”.
    May I request you to please help me to login. I have mailed you the alert log.
    In my istener.ora & tnsnames.ora I have the value for Host as actual Hostname instead of IP or Localhost
    Thanks in advance!!!:)

    VN:F [1.9.22_1171]
    Rating: 0 (from 0 votes)
  46. Vino

    Anyone have any luck installing on Win 10?

    VA:F [1.9.22_1171]
    Rating: 0 (from 0 votes)
    1. JDEClouds

      Hi Vino,

      We Installed on Win 10 ! It’s working fine. You can follow our guide or video to install Standalone 9.2 on Windows 10.

      VN:F [1.9.22_1171]
      Rating: 0 (from 0 votes)
  47. shekharoo

    I am unable to edit Business function, getting error like “Unable to start microsoft visual C++ 7.1…”. May i know what may be the possible issues?

    VN:F [1.9.22_1171]
    Rating: 0 (from 0 votes)
    1. JDEClouds

      You have issue with your VS Studio or jde.ini

      You should use visual stuido 2010/2013 Professional or Enterprise Edition and make sure that you have below setting in your jde.ini

      VisualStudioVersion=2013 for VS 2013
      VisualStudioVersion=10 for VS 2010

      VN:F [1.9.22_1171]
      Rating: 0 (from 0 votes)
  48. lincoln01

    Hi, I have a similar database connection issue as above however there does not seem to be an answer. Some background. I have installed 9.2 several times to see if I fix the error. I found that after in install the jde client it works. However when I reboot I get the error in the log OCI0000375. I do not want to keep doing the same thing over and over… I have tried the fully qualified path in the listener file under e1local.

    4656/3572 MAIN_THREAD Thu Jan 12 09:24:52.675000 jdb_ctl.c4196
    Starting OneWorld

    4656/3572 MAIN_THREAD Thu Jan 12 09:24:55.964000 JDETOOLS.c3065
    LIB0000569 – WARNING!!! [SECURITY][Password] Password not encrypted in the INI

    4232/11016 UNKNOWN Thu Jan 12 09:24:55.979000 jdeksec.c786
    INITIALIZING SECURITY SERVER KERNEL

    4232/11016 UNKNOWN Thu Jan 12 09:24:55.995000 jdeksec.c803
    WARNING – failed to find site keys in JDE.INI

    4232/11016 UNKNOWN Thu Jan 12 09:24:55.995001 JDETOOLS.c3065
    LIB0000569 – WARNING!!! [SECURITY][Password] Password not encrypted in the INI

    4232/11016 UNKNOWN Thu Jan 12 09:24:56.017000 netpub.c999
    JDENet already initialized

    4232/11016 UNKNOWN Thu Jan 12 09:24:56.017001 jdb_ctl.c3121
    Net init failed or not initialized

    4232/11016 UNKNOWN Thu Jan 12 09:24:56.032000 JDETOOLS.c3065
    LIB0000569 – WARNING!!! [SECURITY][Password] Password not encrypted in the INI

    4232/11016 UNKNOWN Thu Jan 12 09:24:57.103000 dbinitcn.c775
    OCI0000374 – Failed to connect to the database instance

    4232/11016 UNKNOWN Thu Jan 12 09:24:57.103001 dbinitcn.c780
    OCI0000375 – Error – ORA-12514: TNS:listener does not currently know of service requested in connect descriptor

    4232/11016 UNKNOWN Thu Jan 12 09:24:57.103002 dbinitcn.c449
    OCI0000064 – Unable to create database server connection

    4232/11016 UNKNOWN Thu Jan 12 09:24:57.103003 dbinitcn.c542
    OCI0000367 – Unable to connect to Oracle ORA-12514: TNS:listener does not currently know of service requested in connect descriptor

    4232/11016 UNKNOWN Thu Jan 12 09:24:57.103004 jdb_drvm.c798
    JDB9900164 – Failed to connect to E1Local

    4232/11016 UNKNOWN Thu Jan 12 09:24:57.119000 JTP_CM.c282
    JDB9909003 – Could not init connect.

    4232/11016 UNKNOWN Thu Jan 12 09:24:57.119001 JTP_TM.c1140
    JDB9909100 – Get connect info failed: Transaction ID =

    4232/11016 UNKNOWN Thu Jan 12 09:24:57.119002 jdb_rq1.c2458
    JDB3100013 – Failed to get connectinfo

    4232/11016 UNKNOWN Thu Jan 12 09:24:57.119003 jdb_omp1.c3369
    JDB9900257 – Failed to open F986101

    4232/11016 UNKNOWN Thu Jan 12 09:24:57.265000 dbinitcn.c775
    OCI0000374 – Failed to connect to the database instance

    4232/11016 UNKNOWN Thu Jan 12 09:24:57.265001 dbinitcn.c780
    OCI0000375 – Error – ORA-12514: TNS:listener does not currently know of service requested in connect descriptor

    4232/11016 UNKNOWN Thu Jan 12 09:24:57.265002 dbinitcn.c449
    OCI0000064 – Unable to create database server connection

    4232/11016 UNKNOWN Thu Jan 12 09:24:57.283000 dbinitcn.c542
    OCI0000367 – Unable to connect to Oracle ORA-12514: TNS:listener does not currently know of service requested in connect descriptor

    4232/11016 UNKNOWN Thu Jan 12 09:24:57.286000 jdb_drvm.c798
    JDB9900164 – Failed to connect to E1Local

    4232/11016 UNKNOWN Thu Jan 12 09:24:57.288000 JTP_CM.c282
    JDB9909003 – Could not init connect.

    4232/11016 UNKNOWN Thu Jan 12 09:24:57.288001 JTP_TM.c1140
    JDB9909100 – Get connect info failed: Transaction ID =

    4232/11016 UNKNOWN Thu Jan 12 09:24:57.288002 jdb_rq1.c2458
    JDB3100013 – Failed to get connectinfo

    4232/11016 UNKNOWN Thu Jan 12 09:24:57.288003 jdb_omp1.c1220
    JDB9900240 – Failed to open F986101

    4232/11016 UNKNOWN Thu Jan 12 09:24:57.288004 jdb_cach.c1369
    JDB9900009 – Failed to load ObjectMap Cache

    4232/11016 UNKNOWN Thu Jan 12 09:24:57.303000 jdb_cach.c1386
    Unable to load primary Object Configuration Manager – switching to secondary

    4232/11016 UNKNOWN Thu Jan 12 09:24:57.303001 jdb_omp1.c651
    JDB9900247 – Failed to find F98611 System Local in cache

    4232/11016 UNKNOWN Thu Jan 12 09:24:57.303002 jdb_rq1.c2023
    JDB3100011 – Failed to get location of table F986101 for environment DEMO920

    4232/11016 UNKNOWN Thu Jan 12 09:24:57.303003 jdb_omp1.c3369
    JDB9900257 – Failed to open F986101

    4232/11016 UNKNOWN Thu Jan 12 09:24:57.319000 jdb_omp1.c651
    JDB9900247 – Failed to find F98611 System Local in cache

    4232/11016 UNKNOWN Thu Jan 12 09:24:57.319001 jdb_rq1.c2023
    JDB3100011 – Failed to get location of table F986101 for environment DEMO920

    4232/11016 UNKNOWN Thu Jan 12 09:24:57.319002 jdb_omp1.c1220
    JDB9900240 – Failed to open F986101

    4232/11016 UNKNOWN Thu Jan 12 09:24:57.319003 jdb_cach.c1369
    JDB9900009 – Failed to load ObjectMap Cache

    4232/11016 UNKNOWN Thu Jan 12 09:24:57.319004 jdb_omp1.c629
    JDB9900246 – Failed to find existence of default OMAP for environment DEMO920

    4232/11016 UNKNOWN Thu Jan 12 09:24:57.335000 jdb_rq1.c2023
    JDB3100011 – Failed to get location of table F00921 for environment DEMO920

    4232/11016 UNKNOWN Thu Jan 12 09:24:57.335001 jdecgsc.c201
    MSC0000028 – Could not load F00921 cache

    4232/11016 UNKNOWN Thu Jan 12 09:24:57.335002 jdb_rq1.c3061
    JDB2700019 – Failed to get data source for the table

    4232/11016 UNKNOWN Thu Jan 12 09:24:57.335003 jdb_omp1.c629
    JDB9900246 – Failed to find existence of default OMAP for environment DEMO920

    4232/11016 UNKNOWN Thu Jan 12 09:24:57.350000 jdb_rq1.c2023
    JDB3100011 – Failed to get location of table F00941 for environment DEMO920

    4232/11016 UNKNOWN Thu Jan 12 09:24:57.350001 jdb_ctl.c819
    JDB9900408 – Failed to get package release level

    4232/11016 UNKNOWN Thu Jan 12 09:24:57.350002 jdb_ctl.c4439
    JDB1100016 – Failed to load Environment – DEMO920

    4232/11016 UNKNOWN Thu Jan 12 09:24:57.350003 jdb_omp1.c629
    JDB9900246 – Failed to find existence of default OMAP for environment DEMO920

    4232/11016 UNKNOWN Thu Jan 12 09:24:57.366000 jdb_rq1.c2023
    JDB3100011 – Failed to get location of table F00941 for environment DEMO920

    4232/11016 UNKNOWN Thu Jan 12 09:24:57.366001 jdb_omp1.c629
    JDB9900246 – Failed to find existence of default OMAP for environment DEMO920

    4232/11016 UNKNOWN Thu Jan 12 09:24:57.366002 jdb_rq1.c2023
    JDB3100011 – Failed to get location of table F00942 for environment DEMO920

    4232/11016 UNKNOWN Thu Jan 12 09:24:57.382000 SpecUtil.c5156
    JDESPEC0000051 – Unable to open F00942 to load metadata cache. Fatal Error.

    4232/11016 UNKNOWN Thu Jan 12 09:24:57.385000 SpecUtil.c5195
    JDESPEC0000052 – Unable to select all records from F00942 to load metadata cache. Fatal Error.

    4232/11016 UNKNOWN Thu Jan 12 09:24:57.388000 SpecUtil.c5068
    Metadata release cache handle destroyed before it could be used. System probably being shut down. Returning failure.

    4232/11016 UNKNOWN Thu Jan 12 09:24:57.388001 SpecOpen.c1845
    JDESPEC0000059 – Unable to determine spec release level of the data source DEMO. Cannot determine metadata format version of this path code. Cannot acccess metadata (specs)! Fatal Error.

    4232/11016 UNKNOWN Thu Jan 12 09:24:57.388002 SpecOpen.c2633
    jdeSpecOpenLocal completed in error – JDESPECRESULT_FAILED.

    4232/11016 UNKNOWN Thu Jan 12 09:24:57.388003 evtcache.c890
    isNewRTESystemEnabled – DDTABL spec handle cannot be accessed.

    4232/11016 WRK:Starting jdeCallObject Thu Jan 12 09:24:57.404000 jdb_omp1.c629
    JDB9900246 – Failed to find existence of default OMAP for environment DEMO920

    4232/11016 WRK:Starting jdeCallObject Thu Jan 12 09:24:57.404001 jdb_rq1.c2023
    JDB3100011 – Failed to get location of table F00942 for environment DEMO920

    4232/11016 WRK:Starting jdeCallObject Thu Jan 12 09:24:57.404002 SpecUtil.c5156
    JDESPEC0000051 – Unable to open F00942 to load metadata cache. Fatal Error.

    4232/11016 WRK:Starting jdeCallObject Thu Jan 12 09:24:57.404003 SpecUtil.c5195
    JDESPEC0000052 – Unable to select all records from F00942 to load metadata cache. Fatal Error.

    4232/11016 WRK:Starting jdeCallObject Thu Jan 12 09:24:57.404004 SpecUtil.c5068
    Metadata release cache handle destroyed before it could be used. System probably being shut down. Returning failure.

    4232/11016 WRK:Starting jdeCallObject Thu Jan 12 09:24:57.419000 SpecOpen.c1845
    JDESPEC0000059 – Unable to determine spec release level of the data source DEMO. Cannot determine metadata format version of this path code. Cannot acccess metadata (specs)! Fatal Error.

    4232/11016 WRK:Starting jdeCallObject Thu Jan 12 09:24:57.419001 SpecOpen.c2633
    jdeSpecOpenLocal completed in error – JDESPECRESULT_FAILED.

    4232/11016 WRK:Starting jdeCallObject Thu Jan 12 09:24:57.466000 secutil.c422
    Failed to init security bootstrap environment using user=DEMO, env=DEMO920, role=*ALL

    4232/11016 WRK:Starting jdeCallObject Thu Jan 12 09:24:57.482000 jdeksec.c3864
    Failed to init Env

    4232/11016 WRK:Starting jdeCallObject Thu Jan 12 09:24:57.486000 netflow.c1219
    Dispatch Function ‘[email protected]’ returned failure on eNetDispatchInit

    4656/3572 MAIN_THREAD Thu Jan 12 09:26:15.997000 jdecsec.c2219
    JDENET Error = eTimeOut

    4656/3572 MAIN_THREAD Thu Jan 12 09:26:38.246000 jdecsec.c2706
    Failed to communicate with security server: Unable to locate Security Server

    4656/3572 MAIN_THREAD Thu Jan 12 09:26:41.022000 jdecsec.c264
    Failed to validate user DEMO by password

    4656/3572 MAIN_THREAD Thu Jan 12 09:26:41.033000 jdb_ctl.c4902
    JDB1100018 – Failed to get past Security check

    4656/3572 MAIN_THREAD Thu Jan 12 09:26:41.687000 msc_signon.cpp227
    ValidateUser failed from SignOn

    4656/3572 MAIN_THREAD Thu Jan 12 09:26:43.145000 jdb_ctl.c4306
    JDB1100012 – Failed to validate Sign on

    4656/3572 MAIN_THREAD Thu Jan 12 09:26:43.161000 SpecUtil.c5156
    JDESPEC0000051 – Unable to open F00942 to load metadata cache. Fatal Error.

    4656/3572 MAIN_THREAD Thu Jan 12 09:26:43.170000 SpecUtil.c5195
    JDESPEC0000052 – Unable to select all records from F00942 to load metadata cache. Fatal Error.

    4656/3572 MAIN_THREAD Thu Jan 12 09:26:43.173000 SpecUtil.c5068
    Metadata release cache handle destroyed before it could be used. System probably being shut down. Returning failure.

    4656/3572 MAIN_THREAD Thu Jan 12 09:26:43.176000 SpecOpen.c1845
    JDESPEC0000059 – Unable to determine spec release level of the data source DEMO. Cannot determine metadata format version of this path code. Cannot acccess metadata (specs)! Fatal Error.

    4656/3572 MAIN_THREAD Thu Jan 12 09:26:43.181000 SpecOpen.c2633
    jdeSpecOpenLocal completed in error – JDESPECRESULT_FAILED.

    4656/3572 MAIN_THREAD Thu Jan 12 09:26:43.189000 evtcache.c890
    isNewRTESystemEnabled – DDTABL spec handle cannot be accessed.

    4656/3572 WRK:Starting jdeCallObject Thu Jan 12 09:26:43.192000 SpecUtil.c5156
    JDESPEC0000051 – Unable to open F00942 to load metadata cache. Fatal Error.

    4656/3572 WRK:Starting jdeCallObject Thu Jan 12 09:26:43.196000 SpecUtil.c5195
    JDESPEC0000052 – Unable to select all records from F00942 to load metadata cache. Fatal Error.

    4656/3572 WRK:Starting jdeCallObject Thu Jan 12 09:26:43.202000 SpecUtil.c5068
    Metadata release cache handle destroyed before it could be used. System probably being shut down. Returning failure.

    4656/3572 WRK:Starting jdeCallObject Thu Jan 12 09:26:43.206000 SpecOpen.c1845
    JDESPEC0000059 – Unable to determine spec release level of the data source DEMO. Cannot determine metadata format version of this path code. Cannot acccess metadata (specs)! Fatal Error.

    4656/3572 WRK:Starting jdeCallObject Thu Jan 12 09:26:43.209000 SpecOpen.c2633
    jdeSpecOpenLocal completed in error – JDESPECRESULT_FAILED.

    4656/3572 WRK:Starting jdeCallObject Thu Jan 12 09:26:43.220000 jdb_ctl.c1364
    JDB4100001 – Failed to validate Env handle

    4656/3572 WRK:Starting jdeCallObject Thu Jan 12 09:26:43.270000 jdb_ctl.c10594
    JDB1200017 – Exiting JDB_GetLocalClientEnv with NULL hEnv.

    4232/948 MAIN_THREAD Thu Jan 12 09:26:43.316000 netpub.c3488
    Info:Net program ended(JDENET_RunNet), pid = 4232, JDENETError = 0

    4232/948 MAIN_THREAD Thu Jan 12 09:26:43.323000 IPCMISC.C299
    API ipcSawUnregisterProcV1 : process 4232 unregistered in entry 0

    VN:F [1.9.22_1171]
    Rating: 0 (from 0 votes)
    1. JDEClouds

      Hi,

      You have issue with DB connection.

      OCI0000367 – Unable to connect to Oracle ORA-12514: TNS:listener does not currently know of service requested in connect descriptor

      Did you copied the tnsnames.ora file to your Oracle 32 bit client ? Try to login to DB from SQLPLUS and update us.

      VN:F [1.9.22_1171]
      Rating: 0 (from 0 votes)
      1. lincoln01

        I reinstalled to a new directory Oracle3 to get this installed and running. It ran great. Next problem is the web server would not start.I reinstalled the web server as stand alone under the new oracle home. Now the listener will not start. Probably due to the oracle home. Looks like I am going in circles…

        VN:F [1.9.22_1171]
        Rating: 0 (from 0 votes)
  49. criscat

    Thanks for the tutorial. Worked well but web client only displays the horizontal top blue bar and nothing below. Please help, no error messages.

    VN:F [1.9.22_1171]
    Rating: 0 (from 0 votes)
    1. JDEClouds

      Hi,

      Can you send the screenshot of your issue and jas.log & jderoot.log to troubleshoot your issue.

      VN:F [1.9.22_1171]
      Rating: 0 (from 0 votes)
      1. criscat

        I rebooted and the web server started working… It’s perfect now, but web interface a bit slow. Is there a way to install fat client as well?

        VN:F [1.9.22_1171]
        Rating: 0 (from 0 votes)
  1. JD Edwards EnterpriseOne 9.2 Standalone Installation on YouTube.com by Jde | JDE Source

    […] Standalone guide can be found at these two websites listed below, JDEE1Tips : JDE001 – Install JD Edwards Standalone E920 JDESource : JD Edwards 9.2 Standalone (DEMO) Installation Tutorial […]

Leave a Reply